develooper Front page | perl.perl5.porters | Postings from August 2010

Smoke [5.13.3] v5.13.3-160-g77db647 FAIL(XF) netbsd 5.0.2 (i386/1 cpu)

From:
Steven Schubiger
Date:
August 3, 2010 23:13
Subject:
Smoke [5.13.3] v5.13.3-160-g77db647 FAIL(XF) netbsd 5.0.2 (i386/1 cpu)
Message ID:
4c5904f5.6250cc0a.6ab3.ffffed09@mx.google.com
Automated smoke report for 5.13.3 patch 77db6475b99dada0ff1239a4df9b8e365b2ee260 v5.13.3-160-g77db647
p5netbsd: Intel 686-class (i386/1 cpu)
    on        netbsd - 5.0.2
    using     cc version 4.1.3 20080704 prerelease (NetBSD nb2 20081120)
    smoketime 9 hours 44 minutes (average 1 hour 13 minutes)

Summary: FAIL(XF)

O = OK  F = Failure(s), extended report at the bottom
X = Failure(s) under TEST but not under harness
? = still running or test results not (yet) available
Build failures during:       - = unknown or N/A
c = Configure, m = make, M = make (after miniperl), t = make test-prep

v5.13.3-160-g77db647  Configuration (common) none
----------- ---------------------------------------------------------
O O O O     
O X O O     -Duse64bitint
F X O O     -Duseithreads
O O O O     -Duseithreads -Duse64bitint
| | | +----- PERLIO = perlio -DDEBUGGING
| | +------- PERLIO = stdio  -DDEBUGGING
| +--------- PERLIO = perlio
+----------- PERLIO = stdio


Locally applied patches:
    uncommitted-changes
    SMOKE77db6475b99dada0ff1239a4df9b8e365b2ee260

Failures: (common-args) none
[perlio] -Duse64bitint
Inconsistent test results (between TEST and harness):
    ../lib/Benchmark.t......................FAILED at test 13

[stdio] -Duseithreads
    ../lib/Benchmark.t..........................................FAILED
        126-127
        Non-zero exit status: 2

[perlio] -Duseithreads
Inconsistent test results (between TEST and harness):
    ../lib/Benchmark.t......................FAILED at test 126

Compiler messages(gcc):
perlio.c: In function 'PerlIOStdio_set_ptrcnt':
perlio.c:3436: warning: pointer targets in assignment differ in signedness
/usr/include/sys/cdefs_elf.h:67:20: error: missing binary operator before token "("
<command line>:1:1: warning: "TIME_HIRES_STAT" redefined
<command line>:1:1: warning: this is the location of the previous definition
APItest.c: In function 'XS_XS__APItest__PtrTable_clear':
APItest.c:1275: warning: 'Perl_ptr_table_clear' is deprecated (declared at ../../proto.h:4392)
regexec.c: In function 'S_regtry':
regexec.c:3172: warning: 'charid' may be used uninitialized in this function

-- 
Report by Test::Smoke v1.43 build 1271 running on perl 5.10.1
(Reporter v0.035 / Smoker v0.045)



nntp.perl.org: Perl Programming lists via nntp and http.
Comments to Ask Bjørn Hansen at ask@perl.org | Group listing | About