develooper Front page | perl.perl5.porters | Postings from August 2010

Smoke [5.13.3] v5.13.3-159-g15b9d41 FAIL(F) openvms V8.3-1H1 (IA64/2cpu)

From:
Craig A. Berry
Date:
August 3, 2010 01:21
Subject:
Smoke [5.13.3] v5.13.3-159-g15b9d41 FAIL(F) openvms V8.3-1H1 (IA64/2cpu)
Message ID:
0L6K003NBHWDFF60@asmtp020.mac.com
Automated smoke report for 5.13.3 patch 15b9d41f9f21b061074f5077a909475664dea6ca v5.13.3-159-g15b9d41
ALMA: HP rx2600  (1.50GHz/6.0MB) (IA64/2 cpu)
    on        openvms - V8.3-1H1
    using     ? CC/DECC version 70390019
    smoketime 5 hours 33 minutes (average 2 hours 46 minutes)

Summary: FAIL(F)

O = OK  F = Failure(s), extended report at the bottom
X = Failure(s) under TEST but not under harness
? = still running or test results not (yet) available
Build failures during:       - = unknown or N/A
c = Configure, m = make, M = make (after miniperl), t = make test-prep

v5.13.3-159-g15b9d41  Configuration (common) none
----------- ---------------------------------------------------------
F -         
F -         -Duseithreads
| +--------- -DDEBUGGING
+----------- no debugging


Locally applied patches:
    uncommitted-changes
    SMOKE15b9d41f9f21b061074f5077a909475664dea6ca

Failures: (common-args) none
[default] 
    t/op/alarm.....................................................FAILED--unexpected output at test 2
    cpan/autodie/t/open............................................FAILED at test 13
    cpan/ExtUtils-MakeMaker/t/prereq...............................FAILED--expected 13 tests, saw 5
    cpan/Module-Build/t/tilde......................................FAILED at test 16
    cpan/Test-Harness/t/source_handler.............................FAILED at test 93
    cpan/Test-Harness/t/source.....................................FAILED at test 36
    cpan/Time-HiRes/t/HiRes........................................FAILED at test 41
    t/porting/exec-bit.............................................FAILED at test 2

[default] -Duseithreads
    t/op/alarm.....................................................FAILED--unexpected output at test 2
    cpan/autodie/t/open............................................FAILED at test 13
    cpan/ExtUtils-MakeMaker/t/prereq...............................FAILED--expected 13 tests, saw 5
    cpan/Module-Build/t/tilde......................................FAILED at test 16
    cpan/Test-Harness/t/source_handler.............................FAILED at test 93
    cpan/Test-Harness/t/source.....................................FAILED at test 36
    cpan/Time-HiRes/t/HiRes........................................FAILED--expected 48 tests, saw 38
    t/porting/exec-bit.............................................FAILED at test 2

-- 
Report by Test::Smoke v1.39 build 1235 running on perl 5.10.0
(Reporter v0.035 / Smoker v0.044)



nntp.perl.org: Perl Programming lists via nntp and http.
Comments to Ask Bjørn Hansen at ask@perl.org | Group listing | About