develooper Front page | perl.perl5.porters | Postings from July 2010

Smoke [5.12.1] v5.12.1-62-ga812667 FAIL(F) openvms V8.3-1H1 (IA64/2cpu)

From:
Craig A. Berry
Date:
July 31, 2010 18:53
Subject:
Smoke [5.12.1] v5.12.1-62-ga812667 FAIL(F) openvms V8.3-1H1 (IA64/2cpu)
Message ID:
0L6G001AWAKDO350@asmtp013.mac.com
Automated smoke report for 5.12.1 patch a812667ac70fa062909d32a87ad9c756098c49bf v5.12.1-62-ga812667
ALMA: HP rx2600  (1.50GHz/6.0MB) (IA64/2 cpu)
    on        openvms - V8.3-1H1
    using     ? CC/DECC version 70390019
    smoketime 5 hours 29 minutes (average 2 hours 44 minutes)

Summary: FAIL(F)

O = OK  F = Failure(s), extended report at the bottom
X = Failure(s) under TEST but not under harness
? = still running or test results not (yet) available
Build failures during:       - = unknown or N/A
c = Configure, m = make, M = make (after miniperl), t = make test-prep

v5.12.1-62-ga812667  Configuration (common) none
----------- ---------------------------------------------------------
F -         
F -         -Duseithreads
| +--------- -DDEBUGGING
+----------- no debugging


Locally applied patches:
    uncommitted-changes
    SMOKEa812667ac70fa062909d32a87ad9c756098c49bf

Failures: (common-args) none
[default] 
    t/op/caller....................................................FAILED--unexpected output at test 31
    cpan/ExtUtils-Constant/t/Constant..............................FAILED at test 96

[default] -Duseithreads
    t/op/caller....................................................FAILED--unexpected output at test 31
    cpan/Time-HiRes/t/HiRes........................................FAILED--expected 40 tests, saw 39

-- 
Report by Test::Smoke v1.39 build 1235 running on perl 5.10.0
(Reporter v0.035 / Smoker v0.044)



nntp.perl.org: Perl Programming lists via nntp and http.
Comments to Ask Bjørn Hansen at ask@perl.org | Group listing | About