develooper Front page | perl.perl5.porters | Postings from July 2010

Smoke [5.13.3] v5.13.3-128-g1850c8f FAIL(F) openvms V8.3-1H1 (IA64/2cpu)

From:
Craig A. Berry
Date:
July 29, 2010 12:12
Subject:
Smoke [5.13.3] v5.13.3-128-g1850c8f FAIL(F) openvms V8.3-1H1 (IA64/2cpu)
Message ID:
0L6C00ERI2OXXK20@asmtp022.mac.com
Automated smoke report for 5.13.3 patch 1850c8f94216e3e6bf08ca1f3121b4a91d01d1bf v5.13.3-128-g1850c8f
ALMA: HP rx2600  (1.50GHz/6.0MB) (IA64/2 cpu)
    on        openvms - V8.3-1H1
    using     ? CC/DECC version 70390019
    smoketime 5 hours 34 minutes (average 2 hours 47 minutes)

Summary: FAIL(F)

O = OK  F = Failure(s), extended report at the bottom
X = Failure(s) under TEST but not under harness
? = still running or test results not (yet) available
Build failures during:       - = unknown or N/A
c = Configure, m = make, M = make (after miniperl), t = make test-prep

v5.13.3-128-g1850c8f  Configuration (common) none
----------- ---------------------------------------------------------
F -         
F -         -Duseithreads
| +--------- -DDEBUGGING
+----------- no debugging


Locally applied patches:
    uncommitted-changes
    SMOKE1850c8f94216e3e6bf08ca1f3121b4a91d01d1bf

Failures: (common-args) none
[default] 
[default] -Duseithreads
    t/op/alarm.....................................................FAILED--unexpected output at test 2
    t/op/caller....................................................FAILED--unexpected output at test 31
    cpan/autodie/t/open............................................FAILED at test 13
    cpan/ExtUtils-MakeMaker/t/prereq...............................FAILED--expected 13 tests, saw 5
    cpan/Module-Build/t/tilde......................................FAILED at test 16
    cpan/Test-Harness/t/source_handler.............................FAILED at test 93
    cpan/Test-Harness/t/source.....................................FAILED at test 36
    cpan/Time-HiRes/t/HiRes........................................FAILED at test 41
    t/porting/exec-bit.............................................FAILED at test 2

-- 
Report by Test::Smoke v1.39 build 1235 running on perl 5.10.0
(Reporter v0.035 / Smoker v0.044)



nntp.perl.org: Perl Programming lists via nntp and http.
Comments to Ask Bjørn Hansen at ask@perl.org | Group listing | About