develooper Front page | perl.perl5.porters | Postings from July 2010

Smoke [5.13.3] v5.13.3-115-g1266f6a FAIL(F) MSWin32 WinXP/.Net SP3 (x86/2 cpu)

From:
Steve Hay
Date:
July 27, 2010 21:26
Subject:
Smoke [5.13.3] v5.13.3-115-g1266f6a FAIL(F) MSWin32 WinXP/.Net SP3 (x86/2 cpu)
Message ID:
UKMAIL02CIqtQvAauNj000038a9@ukmail02.planit.group
Automated smoke report for 5.13.3 patch 1266f6a243b5c49226a55a1f60d6fa0ce69e5b1a v5.13.3-115-g1266f6a
maldoror.bath.planit.group: Intel(R) Core(TM)2 CPU 6700 @ 2.66GHz(~2660 MHz) (x86/2 cpu)
    on        MSWin32 - WinXP/.Net SP3
    using     cl version 12.00.8804
    smoketime 5 hours 49 minutes (average 43 minutes 45 seconds)

Summary: FAIL(F)

O = OK  F = Failure(s), extended report at the bottom
X = Failure(s) under TEST but not under harness
? = still running or test results not (yet) available
Build failures during:       - = unknown or N/A
c = Configure, m = make, M = make (after miniperl), t = make test-prep

v5.13.3-115-g1266f6a  Configuration (common) -DINST_TOP=$(INST_DRV)\Smoke\doesntexist
----------- ---------------------------------------------------------
O O         -Duselargefiles
O O         -Duselargefiles -Duseithreads
F F         -Duselargefiles -Accflags='-DPERL_OLD_COPY_ON_WRITE'
F F         -Duselargefiles -Accflags='-DPERL_OLD_COPY_ON_WRITE' -Duseithreads
| +--------- -DDEBUGGING
+----------- no debugging


Locally applied patches:
    uncommitted-changes
    SMOKE1266f6a243b5c49226a55a1f60d6fa0ce69e5b1a

Failures: (common-args) -DINST_TOP=$(INST_DRV)\Smoke\doesntexist
[default] -Duselargefiles -Accflags='-DPERL_OLD_COPY_ON_WRITE'
[default] -DDEBUGGING -Duselargefiles -Accflags='-DPERL_OLD_COPY_ON_WRITE'
../t/re/subst.t.............................................FAILED
    109
../t/re/subst_wamp.t........................................FAILED
    109
../t/re/substT.t............................................FAILED
    109
../cpan/Compress-Raw-Zlib/t/07bufsize.t.....................FAILED
    Non-zero exit status: 255
    Bad plan.  You planned 288 tests but ran 41.

[default] -Duselargefiles -Accflags='-DPERL_OLD_COPY_ON_WRITE' -Duseithreads
[default] -DDEBUGGING -Duselargefiles -Accflags='-DPERL_OLD_COPY_ON_WRITE' -Duseithreads
../t/re/pat_rt_report_thr.t.................................FAILED
    Non-zero exit status: 5
../t/re/subst.t.............................................FAILED
    109
../t/re/subst_wamp.t........................................FAILED
    109
../t/re/substT.t............................................FAILED
    109
../t/op/reset.t.............................................FAILED
    Non-zero exit status: 5
../cpan/Compress-Raw-Zlib/t/07bufsize.t.....................FAILED
    Non-zero exit status: 255
    Bad plan.  You planned 288 tests but ran 41.

Compiler messages(MSWin32):
Cwd.xs(75) : warning C4101: 'symlink' : unreferenced local variable
Base64.xs(343) : warning C4146: unary minus operator applied to unsigned type, result still unsigned
Base64.xs(345) : warning C4146: unary minus operator applied to unsigned type, result still unsigned
Piece.xs(950) : warning C4101: 'ret' : unreferenced local variable

-- 
Report by Test::Smoke v1.42 build 1267 running on perl 5.11.0
(Reporter v0.035 / Smoker v0.045)




nntp.perl.org: Perl Programming lists via nntp and http.
Comments to Ask Bjørn Hansen at ask@perl.org | Group listing | About