develooper Front page | perl.perl5.porters | Postings from July 2010

Smoke [5.13.3] v5.13.3-93-g454155d FAIL(M) linux 2.6.32-22-generic [debian] (x86_64/8 cpu)

Thread Next
From:
George Greer
Date:
July 27, 2010 03:01
Subject:
Smoke [5.13.3] v5.13.3-93-g454155d FAIL(M) linux 2.6.32-22-generic [debian] (x86_64/8 cpu)
Message ID:
20100727100129.65A2A2039D@zwei
Automated smoke report for 5.13.3 patch 454155d98d52c903969d4c71a5cd1f2f269aaf5f v5.13.3-93-g454155d
zwei: Intel(R) Core(TM) i7 CPU 920 @ 2.67GHz (GenuineIntel 1600MHz) (x86_64/8 cpu)
    on        linux - 2.6.32-22-generic [debian]
    using     cc version 4.4.3
    smoketime 1 hour 29 minutes (average 2 minutes 47.719 seconds)

Summary: FAIL(M)

O = OK  F = Failure(s), extended report at the bottom
X = Failure(s) under TEST but not under harness
? = still running or test results not (yet) available
Build failures during:       - = unknown or N/A
c = Configure, m = make, M = make (after miniperl), t = make test-prep

v5.13.3-93-g454155d  Configuration (common) none
----------- ---------------------------------------------------------
M - - M - - 
M - - M - - -Duse64bitint
M - - M - - -Duselongdouble
M - - M - - -Dusemorebits
M - - M - - -Duseithreads
M - - M - - -Duseithreads -Duse64bitint
M - - M - - -Duseithreads -Duselongdouble
M - - M - - -Duseithreads -Dusemorebits
M - - M - - -Dcc=clang -A append:ccflags=" -fno-stack-protector"
M - - M - - -Dcc=clang -A append:ccflags=" -fno-stack-protector" -Duse64bitint
M - - M - - -Dcc=clang -A append:ccflags=" -fno-stack-protector" -Duselongdouble
M - - M - - -Dcc=clang -A append:ccflags=" -fno-stack-protector" -Dusemorebits
M - - M - - -Dcc=clang -A append:ccflags=" -fno-stack-protector" -Duseithreads
M - - M - - -Dcc=clang -A append:ccflags=" -fno-stack-protector" -Duseithreads -Duse64bitint
M - - M - - -Dcc=clang -A append:ccflags=" -fno-stack-protector" -Duseithreads -Duselongdouble
M - - M - - -Dcc=clang -A append:ccflags=" -fno-stack-protector" -Duseithreads -Dusemorebits
| | | +----- PERLIO = perlio -DDEBUGGING
| | +------- PERLIO = stdio  -DDEBUGGING
| +--------- PERLIO = perlio
+----------- PERLIO = stdio


Locally applied patches:
    uncommitted-changes
    SMOKE454155d98d52c903969d4c71a5cd1f2f269aaf5f

Failures: (common-args) none
[minitest] 
[minitest] -DDEBUGGING
[minitest] -Duse64bitint
[minitest] -DDEBUGGING -Duse64bitint
[minitest] -Duselongdouble
[minitest] -DDEBUGGING -Duselongdouble
[minitest] -Dusemorebits
[minitest] -DDEBUGGING -Dusemorebits
[minitest] -Duseithreads
[minitest] -DDEBUGGING -Duseithreads
[minitest] -Duseithreads -Duse64bitint
[minitest] -DDEBUGGING -Duseithreads -Duse64bitint
[minitest] -Duseithreads -Duselongdouble
[minitest] -DDEBUGGING -Duseithreads -Duselongdouble
[minitest] -Duseithreads -Dusemorebits
[minitest] -DDEBUGGING -Duseithreads -Dusemorebits
[minitest] -Dcc=clang -A append:ccflags=" -fno-stack-protector"
[minitest] -DDEBUGGING -Dcc=clang -A append:ccflags=" -fno-stack-protector"
[minitest] -Dcc=clang -A append:ccflags=" -fno-stack-protector" -Duse64bitint
[minitest] -DDEBUGGING -Dcc=clang -A append:ccflags=" -fno-stack-protector" -Duse64bitint
[minitest] -Dcc=clang -A append:ccflags=" -fno-stack-protector" -Duselongdouble
[minitest] -DDEBUGGING -Dcc=clang -A append:ccflags=" -fno-stack-protector" -Duselongdouble
[minitest] -Dcc=clang -A append:ccflags=" -fno-stack-protector" -Dusemorebits
[minitest] -DDEBUGGING -Dcc=clang -A append:ccflags=" -fno-stack-protector" -Dusemorebits
[minitest] -Dcc=clang -A append:ccflags=" -fno-stack-protector" -Duseithreads
[minitest] -DDEBUGGING -Dcc=clang -A append:ccflags=" -fno-stack-protector" -Duseithreads
[minitest] -Dcc=clang -A append:ccflags=" -fno-stack-protector" -Duseithreads -Duse64bitint
[minitest] -DDEBUGGING -Dcc=clang -A append:ccflags=" -fno-stack-protector" -Duseithreads -Duse64bitint
[minitest] -Dcc=clang -A append:ccflags=" -fno-stack-protector" -Duseithreads -Duselongdouble
[minitest] -DDEBUGGING -Dcc=clang -A append:ccflags=" -fno-stack-protector" -Duseithreads -Duselongdouble
[minitest] -Dcc=clang -A append:ccflags=" -fno-stack-protector" -Duseithreads -Dusemorebits
[minitest] -DDEBUGGING -Dcc=clang -A append:ccflags=" -fno-stack-protector" -Duseithreads -Dusemorebits
    t/comp/hints....................FAILED--expected 24 tests, saw 10
    t/run/fresh_perl................FAILED at test 76
    t/run/switchx...................FAILED--no leader found
    t/io/argv.......................FAILED--no leader found
    t/io/fs.........................FAILED--no leader found
    t/io/utf8.......................FAILED--expected 55 tests, saw 52
    t/re/pat........................FAILED--no leader found
    t/re/pat_advanced...............FAILED--no leader found
    t/re/pat_psycho.................FAILED--no leader found
    t/re/pat_re_eval................FAILED--no leader found
    t/re/pat_rt_report..............FAILED--no leader found
    t/re/pat_special_cc.............FAILED--no leader found
    t/re/reg_fold...................FAILED at test 2
    t/re/reg_mesg...................FAILED at test 43
    t/re/reg_posixcc................FAILED--non-zero wait status: 512
    t/re/regexp.....................FAILED at test 100
    t/re/regexp_noamp...............FAILED at test 100
    t/re/regexp_notrie..............FAILED at test 100
    t/re/regexp_qr..................FAILED at test 100
    t/re/regexp_qr_embed............FAILED at test 100
    t/re/regexp_trielist............FAILED at test 100
    t/re/regexp_unicode_prop........FAILED--no leader found
    t/re/uniprops...................FAILED--no leader found
    t/op/chdir......................FAILED--no leader found
    t/op/die........................FAILED at test 14
    t/op/filehandle.................FAILED--no leader found
    t/op/fork.......................FAILED at test 10
    t/op/groups.....................FAILED--no leader found
    t/op/hash.......................FAILED--no leader found
    t/op/inccode-tie................FAILED--no leader found
    t/op/inccode....................FAILED--no leader found
    t/op/lc.........................FAILED--expected 93 tests, saw 25
    t/op/local......................FAILED at test 304
    t/op/magic......................FAILED at test 27
    t/op/method.....................FAILED--no leader found
    t/op/mkdir......................FAILED--no leader found
    t/op/my_stash...................FAILED--no leader found
    t/op/override...................FAILED at test 26
    t/op/pack.......................FAILED--no leader found
    t/op/readline...................FAILED--no leader found
    t/op/ref........................FAILED--expected 196 tests, saw 118
    t/op/smartmatch.................FAILED--no leader found
    t/op/split......................FAILED--no leader found
    t/op/sprintf2...................FAILED at test 1320
    t/op/stash......................FAILED--expected 38 tests, saw 32
    t/op/stat.......................FAILED--no leader found
    t/op/switch.....................FAILED--expected 160 tests, saw 166
    t/op/taint......................FAILED--no leader found
    t/op/tie........................FAILED at test 2
    t/op/tiehandle..................FAILED--no leader found
    t/op/turkish....................FAILED at test 1
    t/op/universal..................FAILED--no leader found
    t/op/utfhash....................FAILED--expected 99 tests, saw 38
    t/op/utftaint...................FAILED--no leader found
    t/uni/cache.....................FAILED--expected 1 tests, saw 0
    t/uni/class.....................FAILED--expected 10 tests, saw 0
    t/uni/fold......................FAILED--no leader found
    t/uni/lex_utf8..................FAILED--no leader found
    t/uni/lower.....................FAILED--no leader found
    t/uni/overload..................FAILED--expected 215 tests, saw 10
    t/uni/title.....................FAILED--no leader found
    t/uni/upper.....................FAILED--no leader found

Compiler messages(gcc):
try.c: In function ‘main’:
try.c:36: warning: ignoring return value of ‘pipe’, declared with attribute warn_unused_result
try.c:37: warning: ignoring return value of ‘pipe’, declared with attribute warn_unused_result
try.c:53: warning: ignoring return value of ‘write’, declared with attribute warn_unused_result
try.c:66: warning: ignoring return value of ‘write’, declared with attribute warn_unused_result
try.c:72: warning: ignoring return value of ‘write’, declared with attribute warn_unused_result
try.c:78: warning: ignoring return value of ‘read’, declared with attribute warn_unused_result
util.c: In function ‘S_write_no_mem’:
util.c:67: warning: ignoring return value of ‘write’, declared with attribute warn_unused_result
sv.c: In function ‘Perl_sv_2pv_flags’:
sv.c:2771: warning: ignoring return value of ‘gcvt’, declared with attribute warn_unused_result
sv.c:2968: warning: ignoring return value of ‘gcvt’, declared with attribute warn_unused_result
sv.c: In function ‘Perl_sv_vcatpvfn’:
sv.c:9543: warning: ignoring return value of ‘gcvt’, declared with attribute warn_unused_result
sv.c:10348: warning: ignoring return value of ‘gcvt’, declared with attribute warn_unused_result
doio.c: In function ‘Perl_nextargv’:
doio.c:871: warning: ignoring return value of ‘fchown’, declared with attribute warn_unused_result
doio.c: In function ‘S_exec_failed’:
doio.c:1381: warning: ignoring return value of ‘write’, declared with attribute warn_unused_result
perlio.c: In function ‘PerlIO_debug’:
perlio.c:517: warning: ignoring return value of ‘write’, declared with attribute warn_unused_result
perlio.c: In function ‘S_more_refcounted_fds’:
perlio.c:2300: warning: ignoring return value of ‘write’, declared with attribute warn_unused_result
sv.c:2771: warning: ignoring return value of ‘qgcvt’, declared with attribute warn_unused_result
sv.c:2968: warning: ignoring return value of ‘qgcvt’, declared with attribute warn_unused_result
sv.c:10348: warning: ignoring return value of ‘qgcvt’, declared with attribute warn_unused_result
perlio.c:508: warning: ignoring return value of ‘write’, declared with attribute warn_unused_result
perl.c: In function ‘S_init_tls_and_interp’:
perl.c:107: warning: ignoring return value of ‘write’, declared with attribute warn_unused_result
toke.c:1603:2: warning: expression result unused [-Wunused-value]
toke.c:2114:3: warning: expression result unused [-Wunused-value]
toke.c:2116:3: warning: expression result unused [-Wunused-value]
toke.c:2630:3: warning: expression result unused [-Wunused-value]
toke.c:2939:4: warning: expression result unused [-Wunused-value]
toke.c:3037:4: warning: expression result unused [-Wunused-value]
toke.c:3082:8: warning: expression result unused [-Wunused-value]
toke.c:3214:8: warning: expression result unused [-Wunused-value]
toke.c:3363:3: warning: expression result unused [-Wunused-value]
toke.c:3397:5: warning: expression result unused [-Wunused-value]
toke.c:3746:5: warning: expression result unused [-Wunused-value]
toke.c:3820:6: warning: expression result unused [-Wunused-value]
toke.c:7202:7: warning: expression result unused [-Wunused-value]
toke.c:12257:5: warning: expression result unused [-Wunused-value]
toke.c:12752:2: warning: expression result unused [-Wunused-value]
toke.c:12666:5: warning: expression result unused [-Wunused-value]
toke.c:13775:2: warning: expression result unused [-Wunused-value]
toke.c:13913:2: warning: expression result unused [-Wunused-value]
regcomp.c:1453:21: warning: expression result unused [-Wunused-value]
regcomp.c:1487:21: warning: expression result unused [-Wunused-value]
regcomp.c:3414:5: warning: expression result unused [-Wunused-value]
regcomp.c:4405:2: warning: expression result unused [-Wunused-value]
regcomp.c:5748:29: warning: expression result unused [-Wunused-value]
regcomp.c:9513:11: warning: expression result unused [-Wunused-value]
dump.c:298:21: warning: comparison of integers of different signs: 'U8 const' (aka 'unsigned char const') and 'char const' [-Wsign-compare]
dump.c:298:34: warning: comparison of integers of different signs: 'U8 const' (aka 'unsigned char const') and 'char const' [-Wsign-compare]
dump.c:303:22: warning: comparison of integers of different signs: 'U8 const' (aka 'unsigned char const') and 'char const' [-Wsign-compare]
util.c:555:5: warning: expression result unused [-Wunused-value]
util.c:2597:5: warning: expression result unused [-Wunused-value]
util.c:2764:5: warning: expression result unused [-Wunused-value]
mg.c:835:7: warning: expression result unused [-Wunused-value]
mg.c:929:6: warning: expression result unused [-Wunused-value]
mg.c:1061:6: warning: expression result unused [-Wunused-value]
mg.c:1066:2: warning: expression result unused [-Wunused-value]
mro.c:305:4: warning: expression result unused [-Wunused-value]
mro.c:531:2: warning: expression result unused [-Wunused-value]
hv.c:2579:2: warning: expression result unused [-Wunused-value]
pp_hot.c:144:3: warning: expression result unused [-Wunused-value]
pp_hot.c:1218:5: warning: expression result unused [-Wunused-value]
pp_hot.c:1641:3: warning: expression result unused [-Wunused-value]
pp_hot.c:1646:6: warning: expression result unused [-Wunused-value]
pp_hot.c:1659:3: warning: expression result unused [-Wunused-value]
pp_hot.c:1648:2: warning: expression result unused [-Wunused-value]
pp_hot.c:2357:6: warning: expression result unused [-Wunused-value]
sv.c:1978:13: warning: expression result unused [-Wunused-value]
sv.c:1993:9: warning: expression result unused [-Wunused-value]
sv.c:2042:7: warning: expression result unused [-Wunused-value]
sv.c:2086:3: warning: expression result unused [-Wunused-value]
sv.c:2150:7: warning: expression result unused [-Wunused-value]
sv.c:2152:7: warning: expression result unused [-Wunused-value]
sv.c:2212:10: warning: expression result unused [-Wunused-value]
sv.c:2222:25: warning: expression result unused [-Wunused-value]
sv.c:2219:21: warning: expression result unused [-Wunused-value]
sv.c:2540:6: warning: expression result unused [-Wunused-value]
sv.c:2542:6: warning: expression result unused [-Wunused-value]
sv.c:2571:6: warning: expression result unused [-Wunused-value]
sv.c:2575:13: warning: expression result unused [-Wunused-value]
sv.c:2580:17: warning: expression result unused [-Wunused-value]
sv.c:2604:29: warning: expression result unused [-Wunused-value]
sv.c:2608:4: warning: expression result unused [-Wunused-value]
sv.c:2619:33: warning: expression result unused [-Wunused-value]
sv.c:2621:8: warning: expression result unused [-Wunused-value]
sv.c:2582:17: warning: expression result unused [-Wunused-value]
sv.c:2583:17: warning: expression result unused [-Wunused-value]
sv.c:2785:3: warning: expression result unused [-Wunused-value]
sv.c:2790:3: warning: expression result unused [-Wunused-value]
sv.c:3025:5: warning: expression result unused [-Wunused-value]
sv.c:3238:14: warning: expression result unused [-Wunused-value]
sv.c:3247:13: warning: expression result unused [-Wunused-value]
sv.c:3257:13: warning: expression result unused [-Wunused-value]
sv.c:3262:13: warning: expression result unused [-Wunused-value]
sv.c:3628:6: warning: expression result unused [-Wunused-value]
sv.c:3953:6: warning: expression result unused [-Wunused-value]
sv.c:3955:6: warning: expression result unused [-Wunused-value]
sv.c:3969:13: warning: expression result unused [-Wunused-value]
sv.c:3972:6: warning: expression result unused [-Wunused-value]
sv.c:4098:13: warning: expression result unused [-Wunused-value]
sv.c:4338:5: warning: expression result unused [-Wunused-value]
sv.c:4388:5: warning: expression result unused [-Wunused-value]
sv.c:4390:5: warning: expression result unused [-Wunused-value]
sv.c:4443:5: warning: expression result unused [-Wunused-value]
sv.c:4609:6: warning: expression result unused [-Wunused-value]
sv.c:4712:6: warning: expression result unused [-Wunused-value]
sv.c:4781:5: warning: expression result unused [-Wunused-value]
sv.c:4876:5: warning: expression result unused [-Wunused-value]
sv.c:4928:2: warning: expression result unused [-Wunused-value]
sv.c:4960:5: warning: expression result unused [-Wunused-value]
sv.c:5509:2: warning: expression result unused [-Wunused-value]
sv.c:5506:5: warning: expression result unused [-Wunused-value]
sv.c:7231:6: warning: expression result unused [-Wunused-value]
sv.c:7267:6: warning: expression result unused [-Wunused-value]
sv.c:7302:2: warning: expression result unused [-Wunused-value]
sv.c:7068:5: warning: expression result unused [-Wunused-value]
sv.c:7089:5: warning: expression result unused [-Wunused-value]
sv.c:7579:5: warning: expression result unused [-Wunused-value]
sv.c:7972:6: warning: expression result unused [-Wunused-value]
sv.c:8020:5: warning: expression result unused [-Wunused-value]
sv.c:8577:6: warning: expression result unused [-Wunused-value]
sv.c:8578:6: warning: expression result unused [-Wunused-value]
sv.c:8584:6: warning: expression result unused [-Wunused-value]
sv.c:8947:5: warning: expression result unused [-Wunused-value]
sv.c:10469:6: warning: expression result unused [-Wunused-value]
sv.c:10507:2: warning: expression result unused [-Wunused-value]
sv.c:12941:6: warning: expression result unused [-Wunused-value]
pp.c:1606:3: warning: expression result unused [-Wunused-value]
pp.c:1596:2: warning: expression result unused [-Wunused-value]
pp.c:3297:7: warning: expression result unused [-Wunused-value]
pp.c:3302:7: warning: expression result unused [-Wunused-value]
pp.c:3540:2: warning: expression result unused [-Wunused-value]
pp.c:3562:6: warning: expression result unused [-Wunused-value]
pp.c:3537:5: warning: expression result unused [-Wunused-value]
pp.c:3550:5: warning: expression result unused [-Wunused-value]
pp.c:3916:2: warning: expression result unused [-Wunused-value]
pp.c:4052:2: warning: expression result unused [-Wunused-value]
pp.c:4135:4: warning: expression result unused [-Wunused-value]
pp.c:4186:8: warning: expression result unused [-Wunused-value]
pp.c:4313:2: warning: expression result unused [-Wunused-value]
pp.c:4441:4: warning: expression result unused [-Wunused-value]
pp.c:4502:2: warning: expression result unused [-Wunused-value]
pp.c:4503:2: warning: expression result unused [-Wunused-value]
pp_ctl.c:277:2: warning: expression result unused [-Wunused-value]
pp_ctl.c:365:2: warning: expression result unused [-Wunused-value]
pp_ctl.c:377:8: warning: expression result unused [-Wunused-value]
pp_ctl.c:880:7: warning: expression result unused [-Wunused-value]
pp_ctl.c:946:3: warning: expression result unused [-Wunused-value]
pp_ctl.c:518:5: warning: expression result unused [-Wunused-value]
pp_ctl.c:1268:6: warning: expression result unused [-Wunused-value]
pp_ctl.c:2006:3: warning: expression result unused [-Wunused-value]
pp_ctl.c:2021:6: warning: expression result unused [-Wunused-value]
pp_ctl.c:2221:2: warning: expression result unused [-Wunused-value]
pp_ctl.c:3133:2: warning: expression result unused [-Wunused-value]
pp_ctl.c:3945:6: warning: expression result unused [-Wunused-value]
pp_ctl.c:3990:2: warning: expression result unused [-Wunused-value]
pp_ctl.c:4049:5: warning: expression result unused [-Wunused-value]
pp_ctl.c:4125:5: warning: expression result unused [-Wunused-value]
pp_ctl.c:4951:2: warning: expression result unused [-Wunused-value]
pp_ctl.c:5063:5: warning: expression result unused [-Wunused-value]
pp_sys.c:1050:6: warning: expression result unused [-Wunused-value]
pp_sys.c:1259:6: warning: expression result unused [-Wunused-value]
pp_sys.c:1718:2: warning: expression result unused [-Wunused-value]
doop.c:696:3: warning: expression result unused [-Wunused-value]
doop.c:701:2: warning: expression result unused [-Wunused-value]
doop.c:691:5: warning: expression result unused [-Wunused-value]
doop.c:1231:2: warning: expression result unused [-Wunused-value]
doio.c:634:17: warning: expression result unused [-Wunused-value]
doio.c:638:17: warning: expression result unused [-Wunused-value]
doio.c:2091:6: warning: expression result unused [-Wunused-value]
doio.c:2197:5: warning: expression result unused [-Wunused-value]
doio.c:2305:2: warning: expression result unused [-Wunused-value]
regexec.c:1678:17: warning: expression result unused [-Wunused-value]
regexec.c:3910:19: warning: expression result unused [-Wunused-value]
regexec.c:5141:3: warning: expression result unused [-Wunused-value]
utf8.c:2060:5: warning: expression result unused [-Wunused-value]
perlio.c:5324:21: warning: comparison of integers of different signs: 'size_t' (aka 'unsigned long') and 'int' [-Wsign-compare]
pp_pack.c:1529:6: warning: expression result unused [-Wunused-value]
pp_pack.c:1567:3: warning: expression result unused [-Wunused-value]
pp_pack.c:2135:10: warning: expression result unused [-Wunused-value]
pp_pack.c:2409:5: warning: expression result unused [-Wunused-value]
op.c:722:5: warning: expression result unused [-Wunused-value]
op.c:2614:2: warning: expression result unused [-Wunused-value]
op.c:3722:6: warning: expression result unused [-Wunused-value]
op.c:4785:5: warning: expression result unused [-Wunused-value]
op.c:4841:5: warning: expression result unused [-Wunused-value]
op.c:5300:5: warning: expression result unused [-Wunused-value]
op.c:7129:5: warning: expression result unused [-Wunused-value]
op.c:8665:4: warning: expression result unused [-Wunused-value]
perl.c:366:6: warning: expression result unused [-Wunused-value]
perl.c:259:5: warning: expression result unused [-Wunused-value]
perl.c:260:5: warning: expression result unused [-Wunused-value]
perl.c:261:5: warning: expression result unused [-Wunused-value]
perl.c:262:5: warning: expression result unused [-Wunused-value]
perl.c:267:5: warning: expression result unused [-Wunused-value]
perl.c:268:5: warning: expression result unused [-Wunused-value]
perl.c:829:2: warning: expression result unused [-Wunused-value]
perl.c:1039:5: warning: expression result unused [-Wunused-value]
perl.c:1753:5: warning: expression result unused [-Wunused-value]
perl.c:2611:3: warning: expression result unused [-Wunused-value]
perl.c:2712:6: warning: expression result unused [-Wunused-value]
perl.c:2969:8: warning: expression result unused [-Wunused-value]
perl.c:3490:5: warning: expression result unused [-Wunused-value]
perl.c:3549:5: warning: expression result unused [-Wunused-value]
pp_hot.c:173:3: warning: result of comparison against a string literal is unspecified (use strcmp instead)
pp_hot.c:745:2: warning: result of comparison against a string literal is unspecified (use strcmp instead)
pp_hot.c:1573:6: warning: result of comparison against a string literal is unspecified (use strcmp instead)
pp_hot.c:1918:5: warning: result of comparison against a string literal is unspecified (use strcmp instead)
pp_hot.c:2444:5: warning: result of comparison against a string literal is unspecified (use strcmp instead)
pp_hot.c:2451:2: warning: result of comparison against a string literal is unspecified (use strcmp instead)
pp.c:5160:2: warning: result of comparison against a string literal is unspecified (use strcmp instead)
pp.c:5356:2: warning: result of comparison against a string literal is unspecified (use strcmp instead)
pp.c:5406:2: warning: result of comparison against a string literal is unspecified (use strcmp instead)
pp.c:5964:6: warning: result of comparison against a string literal is unspecified (use strcmp instead)
pp_ctl.c:1120:5: warning: result of comparison against a string literal is unspecified (use strcmp instead)
pp_ctl.c:1126:2: warning: result of comparison against a string literal is unspecified (use strcmp instead)
pp_ctl.c:2092:5: warning: result of comparison against a string literal is unspecified (use strcmp instead)
pp_ctl.c:2093:5: warning: result of comparison against a string literal is unspecified (use strcmp instead)
pp_ctl.c:2982:5: warning: result of comparison against a string literal is unspecified (use strcmp instead)
pp_ctl.c:3169:6: warning: result of comparison against a string literal is unspecified (use strcmp instead)
pp_ctl.c:3379:3: warning: result of comparison against a string literal is unspecified (use strcmp instead)
pp_ctl.c:3535:7: warning: result of comparison against a string literal is unspecified (use strcmp instead)
pp_ctl.c:3943:2: warning: result of comparison against a string literal is unspecified (use strcmp instead)
pp_ctl.c:3966:5: warning: result of comparison against a string literal is unspecified (use strcmp instead)
pp_ctl.c:4048:5: warning: result of comparison against a string literal is unspecified (use strcmp instead)
pp_ctl.c:4112:5: warning: result of comparison against a string literal is unspecified (use strcmp instead)
pp_ctl.c:4158:5: warning: result of comparison against a string literal is unspecified (use strcmp instead)
pp_ctl.c:4258:3: warning: result of comparison against a string literal is unspecified (use strcmp instead)
pp_ctl.c:4290:3: warning: result of comparison against a string literal is unspecified (use strcmp instead)
pp_ctl.c:4312:6: warning: result of comparison against a string literal is unspecified (use strcmp instead)
pp_ctl.c:4684:5: warning: result of comparison against a string literal is unspecified (use strcmp instead)
pp_ctl.c:5097:2: warning: result of comparison against a string literal is unspecified (use strcmp instead)
pp_sys.c:327:6: warning: result of comparison against a string literal is unspecified (use strcmp instead)
pp_sys.c:392:5: warning: result of comparison against a string literal is unspecified (use strcmp instead)
pp_sys.c:529:6: warning: result of comparison against a string literal is unspecified (use strcmp instead)
pp_sys.c:591:5: warning: result of comparison against a string literal is unspecified (use strcmp instead)
pp_sys.c:891:5: warning: result of comparison against a string literal is unspecified (use strcmp instead)
pp_sys.c:920:9: warning: result of comparison against a string literal is unspecified (use strcmp instead)
sv.c:2184:21: warning: expression result unused [-Wunused-value]
sv.c:2199:25: warning: expression result unused [-Wunused-value]
sv.c:2531:6: warning: expression result unused [-Wunused-value]
sv.c:2533:6: warning: expression result unused [-Wunused-value]
sv.c:2558:6: warning: expression result unused [-Wunused-value]
sv.c:2560:6: warning: expression result unused [-Wunused-value]
pp_sys.c:1653:10: warning: pointer types point to integer types with different sign passing 'int *', expected 'socklen_t *' [-Wpointer-sign]
pp_sys.c:2607:10: warning: pointer types point to integer types with different sign passing 'int *', expected 'socklen_t *' [-Wpointer-sign]
pp_sys.c:2708:6: warning: pointer types point to integer types with different sign passing 'int *', expected 'socklen_t *' [-Wpointer-sign]
pp_sys.c:2783:6: warning: pointer types point to integer types with different sign passing 'int *', expected 'socklen_t *' [-Wpointer-sign]
pp_sys.c:2787:6: warning: pointer types point to integer types with different sign passing 'int *', expected 'socklen_t *' [-Wpointer-sign]
doio.c:581:11: warning: pointer types point to integer types with different sign passing 'int *', expected 'socklen_t *' [-Wpointer-sign]
regexec.c:2421:2: warning: expression result unused [-Wunused-value]

-- 
Report by Test::Smoke v1.42 build 1267 running on perl 5.10.1
(Reporter v0.035 / Smoker v0.045)


Thread Next


nntp.perl.org: Perl Programming lists via nntp and http.
Comments to Ask Bjørn Hansen at ask@perl.org | Group listing | About