develooper Front page | perl.perl5.porters | Postings from July 2010

Smoke [5.12.1] v5.12.1-28-g765c704 FAIL(M) linux 2.6.32-22-generic [debian] (x86_64/8 cpu)

From:
George Greer
Date:
July 25, 2010 23:35
Subject:
Smoke [5.12.1] v5.12.1-28-g765c704 FAIL(M) linux 2.6.32-22-generic [debian] (x86_64/8 cpu)
Message ID:
20100726063501.04C8F20399@zwei
Automated smoke report for 5.12.1 patch 765c7045405cdf0f0fd923088ca05f84574e6b08 v5.12.1-28-g765c704
zwei: Intel(R) Core(TM) i7 CPU 920 @ 2.67GHz (GenuineIntel 1600MHz) (x86_64/8 cpu)
    on        linux - 2.6.32-22-generic [debian]
    using     cc version 4.4.3
    smoketime 8 hours 26 minutes (average 31 minutes 41 seconds)

Summary: FAIL(M)

O = OK  F = Failure(s), extended report at the bottom
X = Failure(s) under TEST but not under harness
? = still running or test results not (yet) available
Build failures during:       - = unknown or N/A
c = Configure, m = make, M = make (after miniperl), t = make test-prep

v5.12.1-28-g765c704  Configuration (common) none
----------- ---------------------------------------------------------
O O O O O O 
O O O O O O -Duse64bitint
O O O O O O -Duselongdouble
M - - O O O -Dusemorebits
O O O O O O -Duseithreads
O O O O O O -Duseithreads -Duse64bitint
O O O O O O -Duseithreads -Duselongdouble
O O O O O O -Duseithreads -Dusemorebits
| | | | | +- LC_ALL = en_US.utf8 -DDEBUGGING
| | | | +--- PERLIO = perlio -DDEBUGGING
| | | +----- PERLIO = stdio  -DDEBUGGING
| | +------- LC_ALL = en_US.utf8
| +--------- PERLIO = perlio
+----------- PERLIO = stdio 

Locally applied patches:
    uncommitted-changes
    SMOKE765c7045405cdf0f0fd923088ca05f84574e6b08

Failures: (common-args) none
[minitest] -Dusemorebits
    t/comp/hints....................FAILED--expected 24 tests, saw 10
    t/run/fresh_perl................FAILED at test 76
    t/run/switchx...................FAILED--no leader found
    t/io/argv.......................FAILED--no leader found
    t/io/fs.........................FAILED--no leader found
    t/io/utf8.......................FAILED--expected 55 tests, saw 52
    t/re/pat........................FAILED--no leader found
    t/re/pat_advanced...............FAILED--no leader found
    t/re/pat_psycho.................FAILED--no leader found
    t/re/pat_re_eval................FAILED--no leader found
    t/re/pat_rt_report..............FAILED--no leader found
    t/re/pat_special_cc.............FAILED--no leader found
    t/re/reg_fold...................FAILED at test 2
    t/re/reg_mesg...................FAILED at test 43
    t/re/reg_posixcc................FAILED--non-zero wait status: 512
    t/re/regexp.....................FAILED at test 98
    t/re/regexp_noamp...............FAILED at test 98
    t/re/regexp_notrie..............FAILED at test 98
    t/re/regexp_qr..................FAILED at test 98
    t/re/regexp_qr_embed............FAILED at test 98
    t/re/regexp_trielist............FAILED at test 98
    t/re/regexp_unicode_prop........FAILED--no leader found
    t/re/uniprops...................FAILED--no leader found
    t/op/chdir......................FAILED--no leader found
    t/op/die........................FAILED at test 14
    t/op/filehandle.................FAILED--no leader found
    t/op/fork.......................FAILED at test 10
    t/op/groups.....................FAILED--no leader found
    t/op/hash.......................FAILED--no leader found
    t/op/inccode-tie................FAILED--no leader found
    t/op/inccode....................FAILED--no leader found
    t/op/lc.........................FAILED--expected 93 tests, saw 25
    t/op/local......................FAILED at test 294
    t/op/magic......................FAILED at test 27
    t/op/method.....................FAILED--no leader found
    t/op/mkdir......................FAILED--no leader found
    t/op/my_stash...................FAILED--no leader found
    t/op/override...................FAILED at test 26
    t/op/pack.......................FAILED--no leader found
    t/op/readline...................FAILED--no leader found
    t/op/ref........................FAILED--expected 196 tests, saw 118
    t/op/smartmatch.................FAILED--no leader found
    t/op/split......................FAILED--no leader found
    t/op/sprintf2...................FAILED at test 1320
    t/op/stat.......................FAILED--no leader found
    t/op/switch.....................FAILED--expected 132 tests, saw 138
    t/op/taint......................FAILED--no leader found
    t/op/tie........................FAILED at test 2
    t/op/tiehandle..................FAILED--no leader found
    t/op/universal..................FAILED--no leader found
    t/op/utfhash....................FAILED--expected 99 tests, saw 38
    t/op/utftaint...................FAILED--no leader found
    t/uni/cache.....................FAILED--expected 1 tests, saw 0
    t/uni/class.....................FAILED--expected 10 tests, saw 0
    t/uni/fold......................FAILED--no leader found
    t/uni/lex_utf8..................FAILED--no leader found
    t/uni/lower.....................FAILED--no leader found
    t/uni/overload..................FAILED--expected 215 tests, saw 10
    t/uni/title.....................FAILED--no leader found
    t/uni/upper.....................FAILED--no leader found

Compiler messages(gcc):
try.c: In function ‘main’:
try.c:36: warning: ignoring return value of ‘pipe’, declared with attribute warn_unused_result
try.c:37: warning: ignoring return value of ‘pipe’, declared with attribute warn_unused_result
try.c:53: warning: ignoring return value of ‘write’, declared with attribute warn_unused_result
try.c:66: warning: ignoring return value of ‘write’, declared with attribute warn_unused_result
try.c:72: warning: ignoring return value of ‘write’, declared with attribute warn_unused_result
try.c:78: warning: ignoring return value of ‘read’, declared with attribute warn_unused_result
util.c: In function ‘S_write_no_mem’:
util.c:67: warning: ignoring return value of ‘write’, declared with attribute warn_unused_result
sv.c: In function ‘Perl_sv_2pv_flags’:
sv.c:2772: warning: ignoring return value of ‘gcvt’, declared with attribute warn_unused_result
sv.c:2965: warning: ignoring return value of ‘gcvt’, declared with attribute warn_unused_result
sv.c: In function ‘Perl_sv_vcatpvfn’:
sv.c:9422: warning: ignoring return value of ‘gcvt’, declared with attribute warn_unused_result
sv.c:10227: warning: ignoring return value of ‘gcvt’, declared with attribute warn_unused_result
doio.c: In function ‘Perl_nextargv’:
doio.c:870: warning: ignoring return value of ‘fchown’, declared with attribute warn_unused_result
doio.c: In function ‘S_exec_failed’:
doio.c:1380: warning: ignoring return value of ‘write’, declared with attribute warn_unused_result
perlio.c: In function ‘PerlIO_debug’:
perlio.c:517: warning: ignoring return value of ‘write’, declared with attribute warn_unused_result
perlio.c: In function ‘S_more_refcounted_fds’:
perlio.c:2301: warning: ignoring return value of ‘write’, declared with attribute warn_unused_result
Dumper.xs: In function ‘DD_dump’:
Dumper.xs:813: warning: format ‘%ld’ expects type ‘long int’, but argument 2 has type ‘U32’
Call.xs: In function ‘filter_call’:
Call.xs:63: warning: format ‘%d’ expects type ‘int’, but argument 3 has type ‘STRLEN’
Call.xs:63: warning: format ‘%d’ expects type ‘int’, but argument 5 has type ‘STRLEN’
Call.xs:100: warning: format ‘%d’ expects type ‘int’, but argument 4 has type ‘STRLEN’
Call.xs:156: warning: format ‘%d’ expects type ‘int’, but argument 3 has type ‘STRLEN’
Call.xs:175: warning: format ‘%d’ expects type ‘int’, but argument 4 has type ‘STRLEN’
sdbm.c: In function ‘makroom’:
sdbm.c:371: warning: ignoring return value of ‘write’, declared with attribute warn_unused_result
APItest.xs: In function ‘XS_XS__APItest_pmflag’:
APItest.xs:930: warning: ‘Perl_pmflag’ is deprecated (declared at ../../proto.h:2621)
sv.c:2772: warning: ignoring return value of ‘qgcvt’, declared with attribute warn_unused_result
sv.c:2965: warning: ignoring return value of ‘qgcvt’, declared with attribute warn_unused_result
sv.c:10227: warning: ignoring return value of ‘qgcvt’, declared with attribute warn_unused_result
pp_sys.c: In function ‘Perl_pp_gmtime’:
pp_sys.c:4527: warning: format ‘%.0f’ expects type ‘double’, but argument 4 has type ‘Time64_T’
pp_sys.c:4532: warning: format ‘%.0f’ expects type ‘double’, but argument 4 has type ‘Time64_T’
perlio.c:508: warning: ignoring return value of ‘write’, declared with attribute warn_unused_result
perl.c: In function ‘S_init_tls_and_interp’:
perl.c:107: warning: ignoring return value of ‘write’, declared with attribute warn_unused_result
threads.xs: In function ‘S_ithread_create’:
threads.xs:701: warning: ignoring return value of ‘write’, declared with attribute warn_unused_result
pp_sys.c:4527: warning: format ‘%.0f’ expects type ‘double’, but argument 5 has type ‘Time64_T’
pp_sys.c:4532: warning: format ‘%.0f’ expects type ‘double’, but argument 5 has type ‘Time64_T’

-- 
Report by Test::Smoke v1.42 build 1267 running on perl 5.10.1
(Reporter v0.035 / Smoker v0.045)




nntp.perl.org: Perl Programming lists via nntp and http.
Comments to Ask Bjørn Hansen at ask@perl.org | Group listing | About