develooper Front page | perl.perl5.porters | Postings from June 2010

Smoke [5.13.1] v5.13.1-198-g0cb20da FAIL(FM) MSWin32 WinXP/.Net SP3 (x86/2 cpu)

From:
Steve Hay
Date:
June 15, 2010 20:20
Subject:
Smoke [5.13.1] v5.13.1-198-g0cb20da FAIL(FM) MSWin32 WinXP/.Net SP3 (x86/2 cpu)
Message ID:
UKMAIL02MH2knFMjLQZ00001de5@ukmail02.planit.group
Automated smoke report for 5.13.1 patch 0cb20dae370512c655eb665a7d5089db2819e862 v5.13.1-198-g0cb20da
maldoror.bath.planit.group: Intel(R) Core(TM)2 CPU 6700 @ 2.66GHz(~2660 MHz) (x86/2 cpu)
    on        MSWin32 - WinXP/.Net SP3
    using     cl version 12.00.8804
    smoketime 4 hours 37 minutes (average 34 minutes 41 seconds)

Summary: FAIL(FM)

O = OK  F = Failure(s), extended report at the bottom
X = Failure(s) under TEST but not under harness
? = still running or test results not (yet) available
Build failures during:       - = unknown or N/A
c = Configure, m = make, M = make (after miniperl), t = make test-prep

v5.13.1-198-g0cb20da  Configuration (common) -DINST_TOP=$(INST_DRV)\Smoke\doesntexist
----------- ---------------------------------------------------------
O O         -Duselargefiles
M O         -Duselargefiles -Duseithreads
F F         -Duselargefiles -Accflags='-DPERL_OLD_COPY_ON_WRITE'
M F         -Duselargefiles -Accflags='-DPERL_OLD_COPY_ON_WRITE' -Duseithreads
| +--------- -DDEBUGGING
+----------- no debugging


Locally applied patches:
    uncommitted-changes
    SMOKE0cb20dae370512c655eb665a7d5089db2819e862

Failures: (common-args) -DINST_TOP=$(INST_DRV)\Smoke\doesntexist
[default] -Duselargefiles -Accflags='-DPERL_OLD_COPY_ON_WRITE'
[default] -DDEBUGGING -Duselargefiles -Accflags='-DPERL_OLD_COPY_ON_WRITE'
../t/re/subst.t.............................................FAILED
    109
../t/re/subst_wamp.t........................................FAILED
    109
../t/re/substT.t............................................FAILED
    109
../cpan/Compress-Raw-Zlib/t/07bufsize.t.....................FAILED
    Non-zero exit status: 255
    Bad plan.  You planned 288 tests but ran 41.

[default] -DDEBUGGING -Duselargefiles -Accflags='-DPERL_OLD_COPY_ON_WRITE' -Duseithreads
../t/re/pat_rt_report_thr.t.................................FAILED
    Non-zero exit status: 5
../t/re/subst.t.............................................FAILED
    109
../t/re/subst_wamp.t........................................FAILED
    109
../t/re/substT.t............................................FAILED
    109
../t/op/reset.t.............................................FAILED
    Non-zero exit status: 5
../cpan/Compress-Raw-Zlib/t/07bufsize.t.....................FAILED
    Non-zero exit status: 255
    Bad plan.  You planned 288 tests but ran 41.

Passed Todo tests: (common-args) -DINST_TOP=$(INST_DRV)\Smoke\doesntexist
[default] -DDEBUGGING -Duselargefiles -Duseithreads
[default] -DDEBUGGING -Duselargefiles -Accflags='-DPERL_OLD_COPY_ON_WRITE' -Duseithreads
../dist/threads-shared/t/object.t...........................PASSED
    28

Compiler messages(MSWin32):
Cwd.xs(75) : warning C4101: 'symlink' : unreferenced local variable
Base64.xs(343) : warning C4146: unary minus operator applied to unsigned type, result still unsigned
Base64.xs(345) : warning C4146: unary minus operator applied to unsigned type, result still unsigned
..\util.c(96) : error C2065: 'my_perl' : undeclared identifier
..\util.c(96) : error C2223: left of '->IMem' must point to struct/union
..\util.c(189) : error C2223: left of '->IMem' must point to struct/union
..\util.c(276) : error C2223: left of '->IMem' must point to struct/union
..\util.c(322) : error C2223: left of '->IMem' must point to struct/union
..\util.c(324) : error C2223: left of '->IMem' must point to struct/union

-- 
Report by Test::Smoke v1.42 build 1267 running on perl 5.11.0
(Reporter v0.035 / Smoker v0.045)




nntp.perl.org: Perl Programming lists via nntp and http.
Comments to Ask Bjørn Hansen at ask@perl.org | Group listing | About