develooper Front page | perl.perl5.porters | Postings from May 2010

Smoke [5.13.0] v5.13.0-214-g618c9ef FAIL(F) MSWin32 WinXP/.Net SP3 (x86/2 cpu)

From:
Steve Hay
Date:
May 15, 2010 23:38
Subject:
Smoke [5.13.0] v5.13.0-214-g618c9ef FAIL(F) MSWin32 WinXP/.Net SP3 (x86/2 cpu)
Message ID:
UKMAIL02U9BekWo76Ua00000b5a@ukmail02.planit.group
Automated smoke report for 5.13.0 patch 618c9ef5ca707d1f047f20c323241c7349ab59c9 v5.13.0-214-g618c9ef
maldoror.bath.planit.group: Intel(R) Core(TM)2 CPU 6700 @ 2.66GHz(~2660 MHz) (x86/2 cpu)
    on        MSWin32 - WinXP/.Net SP3
    using     bcc32 version 5.5.1
    smoketime 7 hours 43 minutes (average 46 minutes 21 seconds)

Summary: FAIL(F)

O = OK  F = Failure(s), extended report at the bottom
X = Failure(s) under TEST but not under harness
? = still running or test results not (yet) available
Build failures during:       - = unknown or N/A
c = Configure, m = make, M = make (after miniperl), t = make test-prep

v5.13.0-214-g618c9ef  Configuration (common) -DCCTYPE=BORLAND -DINST_TOP=$(INST_DRV)\Smoke\doesntexist
----------- ---------------------------------------------------------
F F         -Duselargefiles
F F         -Duselargefiles -Dusemymalloc
F F         -Duselargefiles -Duseithreads -Uuseimpsys
F F         -Duselargefiles -Duseithreads -Uuseimpsys -Dusemymalloc
F F         -Duselargefiles -Duseithreads
| +--------- -DDEBUGGING
+----------- no debugging


Locally applied patches:
    uncommitted-changes
    SMOKE618c9ef5ca707d1f047f20c323241c7349ab59c9

Failures: (common-args) -DCCTYPE=BORLAND -DINST_TOP=$(INST_DRV)\Smoke\doesntexist
[default] -Duselargefiles
[default] -DDEBUGGING -Duselargefiles
[default] -Duselargefiles -Dusemymalloc
[default] -DDEBUGGING -Duselargefiles -Dusemymalloc
[default] -Duselargefiles -Duseithreads -Uuseimpsys
[default] -DDEBUGGING -Duselargefiles -Duseithreads -Uuseimpsys
[default] -Duselargefiles -Duseithreads
[default] -DDEBUGGING -Duselargefiles -Duseithreads
../t/io/errno.t.............................................FAILED
    1-16

[default] -Duselargefiles -Duseithreads -Uuseimpsys -Dusemymalloc
[default] -DDEBUGGING -Duselargefiles -Duseithreads -Uuseimpsys -Dusemymalloc
../t/io/errno.t.............................................FAILED
    1-16
../t/op/threads.t...........................................FAILED
    Non-zero exit status: 5
    Bad plan.  You planned 18 tests but ran 9.

Compiler messages(bcc32):
Warning W8013 ..\pp_ctl.c 3139: Possible use of 'newsp' before definition in function S_doeval
Warning W8013 ..\pp_ctl.c 3140: Possible use of 'optype' before definition in function S_doeval
Warning W8004 blocksort.c 901: 'numQSorted' is assigned a value that is never used in function mainSort
Warning W8004 compress.c 225: 'zPend' is assigned a value that is never used in function generateMTFValues
Warning W8004 compress.c 598: 'nBytes' is assigned a value that is never used in function sendMTFValues
Warning W8008 decompress.c 588: Condition is always true in function BZ2_decompress
Warning W8008 decompress.c 591: Condition is always true in function BZ2_decompress
Warning W8008 bzlib.c 93: Condition is always false in function bz_config_ok
Warning W8066 bzlib.c 93: Unreachable code in function bz_config_ok
Warning W8008 bzlib.c 94: Condition is always false in function bz_config_ok
Warning W8066 bzlib.c 94: Unreachable code in function bz_config_ok
Warning W8008 bzlib.c 95: Condition is always false in function bz_config_ok
Warning W8066 bzlib.c 95: Unreachable code in function bz_config_ok
Warning W8057 bzlib.c 111: Parameter 'opaque' is never used in function default_bzalloc
Warning W8057 bzlib.c 117: Parameter 'opaque' is never used in function default_bzfree
Warning W8004 bzlib.c 454: 'progress' is assigned a value that is never used in function BZ2_bzCompress
Warning W8066 bzlib.c 866: Unreachable code in function BZ2_bzDecompress
Warning W8008 bzlib.c 866: Condition is always true in function BZ2_bzDecompress
Warning W8008 crc32.c 232: Condition is always true in function crc32
Warning W8066 crc32.c 242: Unreachable code in function crc32
Warning W8004 deflate.c 351: 'hash_head' is assigned a value that is never used in function deflateSetDictionary
Warning W8008 deflate.c 1278: Condition is always false in function fill_window
Warning W8066 deflate.c 1279: Unreachable code in function fill_window
Warning W8004 deflate.c 1669: 'bflush' is assigned a value that is never used in function deflate_slow
Warning W8041 Base64.xs 343: Negating unsigned value in function XS_MIME__QuotedPrint_encode_qp
Warning W8041 Base64.xs 345: Negating unsigned value in function XS_MIME__QuotedPrint_encode_qp

-- 
Report by Test::Smoke v1.42 build 1267 running on perl 5.11.0
(Reporter v0.035 / Smoker v0.045)




nntp.perl.org: Perl Programming lists via nntp and http.
Comments to Ask Bjørn Hansen at ask@perl.org | Group listing | About