Automated smoke report for 5.13.0 patch cfe91bfa026ab1b1865d468d3ab6386d9b410344 v5.13.0-142-gcfe91bf perl-win2k: Intel(R) Core(TM) i7 CPU 920 @ 2.67GHz(~2649 MHz) (x86/2 cpu) on MSWin32 - Win2000 SP4 using cl version 14.00.50727.762 smoketime 5 hours 17 minutes (average 39 minutes 43 seconds) Summary: FAIL(F) O = OK F = Failure(s), extended report at the bottom X = Failure(s) under TEST but not under harness ? = still running or test results not (yet) available Build failures during: - = unknown or N/A c = Configure, m = make, M = make (after miniperl), t = make test-prep v5.13.0-142-gcfe91bf Configuration (common) none ----------- --------------------------------------------------------- O O F O -Duselargefiles O F -Duseithreads F F -Duseithreads -Duselargefiles | +--------- -DDEBUGGING +----------- no debugging Locally applied patches: uncommitted-changes SMOKEcfe91bfa026ab1b1865d468d3ab6386d9b410344 Failures: (common-args) none [default] -Duselargefiles ../lib/Benchmark.t..........................................FAILED 13 Non-zero exit status: 1 [default] -DDEBUGGING -Duseithreads ../cpan/ExtUtils-Command/t/eu_command.t.....................FAILED 8 Non-zero exit status: 1 ../dist/IO/t/io_sock.t......................................FAILED [default] -Duseithreads -Duselargefiles ../cpan/Memoize/t/expmod_t.t................................FAILED 10, 14 [default] -DDEBUGGING -Duseithreads -Duselargefiles ../dist/IO/t/io_sock.t......................................FAILED Compiler messages(MSWin32): Cwd.xs(75) : warning C4101: 'symlink' : unreferenced local variable Base64.xs(343) : warning C4146: unary minus operator applied to unsigned type, result still unsigned Base64.xs(345) : warning C4146: unary minus operator applied to unsigned type, result still unsigned -- Report by Test::Smoke v1.42 build 1267 running on perl 5.10.0 (Reporter v0.035 / Smoker v0.045)