develooper Front page | perl.perl5.porters | Postings from April 2010

Smoke [5.12.0] v5.12.0-21-ga03bd48 FAIL(F) MSWin32 Win2000 SP4 (x86/2 cpu)

From:
George Greer
Date:
April 30, 2010 17:50
Subject:
Smoke [5.12.0] v5.12.0-21-ga03bd48 FAIL(F) MSWin32 Win2000 SP4 (x86/2 cpu)
Message ID:
201005010050.o410oK11001639@m-l.org
Automated smoke report for 5.12.0 patch a03bd4831688fb530e7c376bb9109d188d0fb11a v5.12.0-21-ga03bd48
perl-win2k: Intel(R) Core(TM) i7 CPU 920 @ 2.67GHz(~2649 MHz) (x86/2 cpu)
    on        MSWin32 - Win2000 SP4
    using     cl version 14.00.50727.762
    smoketime 5 hours 5 minutes (average 38 minutes 12 seconds)

Summary: FAIL(F)

O = OK  F = Failure(s), extended report at the bottom
X = Failure(s) under TEST but not under harness
? = still running or test results not (yet) available
Build failures during:       - = unknown or N/A
c = Configure, m = make, M = make (after miniperl), t = make test-prep

v5.12.0-21-ga03bd48  Configuration (common) none
----------- ---------------------------------------------------------
O F         
F F         -Duselargefiles
O F         -Duseithreads
F F         -Duseithreads -Duselargefiles
| +--------- -DDEBUGGING
+----------- no debugging


Locally applied patches:
    uncommitted-changes
    SMOKEa03bd4831688fb530e7c376bb9109d188d0fb11a

Failures: (common-args) none
[default] -DDEBUGGING
../t/op/sselect.t...........................................FAILED
    11

[default] -Duselargefiles
../cpan/ExtUtils-Command/t/eu_command.t.....................FAILED
    8
    Non-zero exit status: 1

[default] -DDEBUGGING -Duselargefiles
../t/op/rand.t..............................................FAILED
    5

[default] -DDEBUGGING -Duseithreads
../dist/IO/t/io_sock.t......................................FAILED
    25
    Non-zero exit status: 255
    Bad plan.  You planned 26 tests but ran 25.

[default] -Duseithreads -Duselargefiles
../t/op/sselect.t...........................................FAILED
    10

[default] -DDEBUGGING -Duseithreads -Duselargefiles
../cpan/Memoize/t/expmod_t.t................................FAILED
    15
../cpan/Time-HiRes/t/HiRes.t................................FAILED
    8, 11, 20-21
../dist/IO/t/io_sock.t......................................FAILED

Compiler messages(MSWin32):
Cwd.xs(75) : warning C4101: 'symlink' : unreferenced local variable

-- 
Report by Test::Smoke v1.42 build 1267 running on perl 5.10.0
(Reporter v0.035 / Smoker v0.045)




nntp.perl.org: Perl Programming lists via nntp and http.
Comments to Ask Bjørn Hansen at ask@perl.org | Group listing | About