develooper Front page | perl.perl5.porters | Postings from April 2010

Smoke [5.12.0] v5.12.0-12-ga4cb5f2 FAIL(XM) linux 2.6.31-20-generic [debian] (x86_64/8 cpu)

From:
George Greer
Date:
April 30, 2010 15:52
Subject:
Smoke [5.12.0] v5.12.0-12-ga4cb5f2 FAIL(XM) linux 2.6.31-20-generic [debian] (x86_64/8 cpu)
Message ID:
20100430225205.D436220215@zwei
Automated smoke report for 5.12.0 patch a4cb5f2834e402bcad4d822e471ee0efce468fe3 v5.12.0-12-ga4cb5f2
zwei: Intel(R) Core(TM) i7 CPU 920 @ 2.67GHz (GenuineIntel 2668MHz) (x86_64/8 cpu)
    on        linux - 2.6.31-20-generic [debian]
    using     cc version 4.4.1
    smoketime 9 hours 17 minutes (average 34 minutes 49 seconds)

Summary: FAIL(XM)

O = OK  F = Failure(s), extended report at the bottom
X = Failure(s) under TEST but not under harness
? = still running or test results not (yet) available
Build failures during:       - = unknown or N/A
c = Configure, m = make, M = make (after miniperl), t = make test-prep

v5.12.0-12-ga4cb5f2  Configuration (common) none
----------- ---------------------------------------------------------
O O O O O O 
O O O O O O -Duse64bitint
O O O O O O -Duselongdouble
O O O O O O -Dusemorebits
O O O O O O -Duseithreads
O O O O O O -Duseithreads -Duse64bitint
O O O O X O -Duseithreads -Duselongdouble
M - - O O O -Duseithreads -Dusemorebits
| | | | | +- LC_ALL = en_US.utf8 -DDEBUGGING
| | | | +--- PERLIO = perlio -DDEBUGGING
| | | +----- PERLIO = stdio  -DDEBUGGING
| | +------- LC_ALL = en_US.utf8
| +--------- PERLIO = perlio
+----------- PERLIO = stdio 

Locally applied patches:
    uncommitted-changes
    SMOKEa4cb5f2834e402bcad4d822e471ee0efce468fe3

Failures: (common-args) none
[perlio] -DDEBUGGING -Duseithreads -Duselongdouble
Inconsistent test results (between TEST and harness):
    ../lib/Benchmark.t......................FAILED at test 13

[minitest] -Duseithreads -Dusemorebits
    t/op/filehandle.................FAILED--no leader found
    t/op/groups.....................FAILED--no leader found
    t/op/magic......................FAILED at test 27
    t/op/switch.....................FAILED--expected 132 tests, saw 138

Compiler messages(gcc):
try.c: In function ‘main’:
try.c:36: warning: ignoring return value of ‘pipe’, declared with attribute warn_unused_result
try.c:37: warning: ignoring return value of ‘pipe’, declared with attribute warn_unused_result
try.c:53: warning: ignoring return value of ‘write’, declared with attribute warn_unused_result
try.c:66: warning: ignoring return value of ‘write’, declared with attribute warn_unused_result
try.c:72: warning: ignoring return value of ‘write’, declared with attribute warn_unused_result
try.c:78: warning: ignoring return value of ‘read’, declared with attribute warn_unused_result
util.c: In function ‘S_write_no_mem’:
util.c:67: warning: ignoring return value of ‘write’, declared with attribute warn_unused_result
sv.c: In function ‘Perl_sv_2pv_flags’:
sv.c:2772: warning: ignoring return value of ‘gcvt’, declared with attribute warn_unused_result
sv.c:2965: warning: ignoring return value of ‘gcvt’, declared with attribute warn_unused_result
sv.c: In function ‘Perl_sv_vcatpvfn’:
sv.c:9422: warning: ignoring return value of ‘gcvt’, declared with attribute warn_unused_result
sv.c:10227: warning: ignoring return value of ‘gcvt’, declared with attribute warn_unused_result
doio.c: In function ‘Perl_nextargv’:
doio.c:870: warning: ignoring return value of ‘fchown’, declared with attribute warn_unused_result
doio.c: In function ‘S_exec_failed’:
doio.c:1380: warning: ignoring return value of ‘write’, declared with attribute warn_unused_result
perlio.c: In function ‘PerlIO_debug’:
perlio.c:517: warning: ignoring return value of ‘write’, declared with attribute warn_unused_result
perlio.c: In function ‘S_more_refcounted_fds’:
perlio.c:2301: warning: ignoring return value of ‘write’, declared with attribute warn_unused_result
Dumper.xs: In function ‘DD_dump’:
Dumper.xs:813: warning: format ‘%ld’ expects type ‘long int’, but argument 2 has type ‘U32’
Call.xs: In function ‘filter_call’:
Call.xs:63: warning: format ‘%d’ expects type ‘int’, but argument 3 has type ‘STRLEN’
Call.xs:63: warning: format ‘%d’ expects type ‘int’, but argument 5 has type ‘STRLEN’
Call.xs:100: warning: format ‘%d’ expects type ‘int’, but argument 4 has type ‘STRLEN’
Call.xs:156: warning: format ‘%d’ expects type ‘int’, but argument 3 has type ‘STRLEN’
Call.xs:175: warning: format ‘%d’ expects type ‘int’, but argument 4 has type ‘STRLEN’
sdbm.c: In function ‘makroom’:
sdbm.c:371: warning: ignoring return value of ‘write’, declared with attribute warn_unused_result
APItest.xs: In function ‘XS_XS__APItest_pmflag’:
APItest.xs:930: warning: ‘Perl_pmflag’ is deprecated (declared at ../../proto.h:2620)
sv.c:2772: warning: ignoring return value of ‘qgcvt’, declared with attribute warn_unused_result
sv.c:2965: warning: ignoring return value of ‘qgcvt’, declared with attribute warn_unused_result
sv.c:10227: warning: ignoring return value of ‘qgcvt’, declared with attribute warn_unused_result
pp_sys.c: In function ‘Perl_pp_gmtime’:
pp_sys.c:4527: warning: format ‘%.0f’ expects type ‘double’, but argument 4 has type ‘Time64_T’
pp_sys.c:4532: warning: format ‘%.0f’ expects type ‘double’, but argument 4 has type ‘Time64_T’
perlio.c:508: warning: ignoring return value of ‘write’, declared with attribute warn_unused_result
perl.c: In function ‘S_init_tls_and_interp’:
perl.c:107: warning: ignoring return value of ‘write’, declared with attribute warn_unused_result
threads.xs: In function ‘S_ithread_create’:
threads.xs:701: warning: ignoring return value of ‘write’, declared with attribute warn_unused_result
pp_sys.c:4527: warning: format ‘%.0f’ expects type ‘double’, but argument 5 has type ‘Time64_T’
pp_sys.c:4532: warning: format ‘%.0f’ expects type ‘double’, but argument 5 has type ‘Time64_T’

-- 
Report by Test::Smoke v1.42 build 1267 running on perl 5.10.0
(Reporter v0.035 / Smoker v0.045)




nntp.perl.org: Perl Programming lists via nntp and http.
Comments to Ask Bjørn Hansen at ask@perl.org | Group listing | About