develooper Front page | perl.perl5.porters | Postings from April 2010

Smoke [5.13.0] v5.13.0-102-g859172f FAIL(F) MSWin32 WinXP/.Net SP3 (x86/2 cpu)

From:
Steve Hay
Date:
April 27, 2010 21:26
Subject:
Smoke [5.13.0] v5.13.0-102-g859172f FAIL(F) MSWin32 WinXP/.Net SP3 (x86/2 cpu)
Message ID:
UKMAIL02ZGYmXvmmKtr00000a0f@ukmail02.planit.group
Automated smoke report for 5.13.0 patch 859172fe8e35383381c4d2edab5f0525b3cb42e8 v5.13.0-102-g859172f
maldoror.bath.planit.group: Intel(R) Core(TM)2 CPU 6700 @ 2.66GHz(~2660 MHz) (x86/2 cpu)
    on        MSWin32 - WinXP/.Net SP3
    using     cl version 12.00.8804
    smoketime 5 hours 46 minutes (average 43 minutes 17 seconds)

Summary: FAIL(F)

O = OK  F = Failure(s), extended report at the bottom
X = Failure(s) under TEST but not under harness
? = still running or test results not (yet) available
Build failures during:       - = unknown or N/A
c = Configure, m = make, M = make (after miniperl), t = make test-prep

v5.13.0-102-g859172f  Configuration (common) -DINST_TOP=$(INST_DRV)\Smoke\doesntexist
----------- ---------------------------------------------------------
O O         -Duselargefiles
O O         -Duselargefiles -Duseithreads
F F         -Duselargefiles -Accflags='-DPERL_OLD_COPY_ON_WRITE'
F F         -Duselargefiles -Accflags='-DPERL_OLD_COPY_ON_WRITE' -Duseithreads
| +--------- -DDEBUGGING
+----------- no debugging


Locally applied patches:
    uncommitted-changes
    SMOKE859172fe8e35383381c4d2edab5f0525b3cb42e8

Failures: (common-args) -DINST_TOP=$(INST_DRV)\Smoke\doesntexist
[default] -Duselargefiles -Accflags='-DPERL_OLD_COPY_ON_WRITE'
[default] -DDEBUGGING -Duselargefiles -Accflags='-DPERL_OLD_COPY_ON_WRITE'
../cpan/Compress-Raw-Zlib/t/07bufsize.t.....................FAILED
    Non-zero exit status: 255
    Bad plan.  You planned 288 tests but ran 41.

[default] -Duselargefiles -Accflags='-DPERL_OLD_COPY_ON_WRITE' -Duseithreads
../t/re/pat_rt_report_thr.t.................................FAILED
    Non-zero exit status: 5
../t/op/reset.t.............................................FAILED
    Non-zero exit status: 5
../cpan/Compress-Raw-Zlib/t/07bufsize.t.....................FAILED
    Non-zero exit status: 255
    Bad plan.  You planned 288 tests but ran 41.

[default] -DDEBUGGING -Duselargefiles -Accflags='-DPERL_OLD_COPY_ON_WRITE' -Duseithreads
../t/re/pat_rt_report_thr.t.................................FAILED
    Non-zero exit status: 3
../t/op/reset.t.............................................FAILED
    Non-zero exit status: 3
../cpan/Compress-Raw-Zlib/t/07bufsize.t.....................FAILED
    Non-zero exit status: 255
    Bad plan.  You planned 288 tests but ran 41.

Compiler messages(MSWin32):
Cwd.xs(75) : warning C4101: 'symlink' : unreferenced local variable
Base64.xs(343) : warning C4146: unary minus operator applied to unsigned type, result still unsigned
Base64.xs(345) : warning C4146: unary minus operator applied to unsigned type, result still unsigned

-- 
Report by Test::Smoke v1.42 build 1267 running on perl 5.11.0
(Reporter v0.035 / Smoker v0.045)




nntp.perl.org: Perl Programming lists via nntp and http.
Comments to Ask Bjørn Hansen at ask@perl.org | Group listing | About