develooper Front page | perl.perl5.porters | Postings from April 2010

Smoke [5.13.0] v5.13.0-101-gf398020 FAIL(F) openvms V8.3-1H1 (IA64/2cpu)

From:
Craig A. Berry
Date:
April 27, 2010 11:17
Subject:
Smoke [5.13.0] v5.13.0-101-gf398020 FAIL(F) openvms V8.3-1H1 (IA64/2cpu)
Message ID:
0L1J00D5VS5BOK00@asmtp014.mac.com
Automated smoke report for 5.13.0 patch f398020d62424dd8a766d0d9b78ced4cfea15968 v5.13.0-101-gf398020
ALMA: HP rx2600  (1.50GHz/6.0MB) (IA64/2 cpu)
    on        openvms - V8.3-1H1
    using     ? CC/DECC version 70390018
    smoketime 5 hours 18 minutes (average 2 hours 39 minutes)

Summary: FAIL(F)

O = OK  F = Failure(s), extended report at the bottom
X = Failure(s) under TEST but not under harness
? = still running or test results not (yet) available
Build failures during:       - = unknown or N/A
c = Configure, m = make, M = make (after miniperl), t = make test-prep

v5.13.0-101-gf398020  Configuration (common) none
----------- ---------------------------------------------------------
F -         
F -         -Duseithreads
| +--------- -DDEBUGGING
+----------- no debugging


Locally applied patches:
    uncommitted-changes
    SMOKEf398020d62424dd8a766d0d9b78ced4cfea15968

Failures: (common-args) none
[default] 
[default] -Duseithreads
    t/op/alarm.....................................................FAILED--unexpected output at test 2
    t/op/taint.....................................................FAILED--unexpected output at test 0
    cpan/ExtUtils-MakeMaker/t/prereq...............................FAILED--expected 13 tests, saw 5
    cpan/ExtUtils-ParseXS/t/more...................................FAILED--expected 25 tests, saw 24

-- 
Report by Test::Smoke v1.39 build 1235 running on perl 5.10.0
(Reporter v0.035 / Smoker v0.044)



nntp.perl.org: Perl Programming lists via nntp and http.
Comments to Ask Bjørn Hansen at ask@perl.org | Group listing | About