develooper Front page | perl.perl5.porters | Postings from April 2010

Smoke [5.13.0] v5.13.0-72-g9b463b2 FAIL(FM) linux 2.6.31-20-generic [debian] (x86_64/8 cpu)

From:
George Greer
Date:
April 26, 2010 12:22
Subject:
Smoke [5.13.0] v5.13.0-72-g9b463b2 FAIL(FM) linux 2.6.31-20-generic [debian] (x86_64/8 cpu)
Message ID:
20100426192229.CF29A20215@zwei
Automated smoke report for 5.13.0 patch 9b463b21d3655b79309f8b461042cebb5733c54e v5.13.0-72-g9b463b2
zwei: Intel(R) Core(TM) i7 CPU 920 @ 2.67GHz (GenuineIntel 2668MHz) (x86_64/8 cpu)
    on        linux - 2.6.31-20-generic [debian]
    using     gcc version 4.4.1
    smoketime 17 hours 45 minutes (average 33 minutes 17 seconds)

Summary: FAIL(FM)

O = OK  F = Failure(s), extended report at the bottom
X = Failure(s) under TEST but not under harness
? = still running or test results not (yet) available
Build failures during:       - = unknown or N/A
c = Configure, m = make, M = make (after miniperl), t = make test-prep

v5.13.0-72-g9b463b2  Configuration (common) none
----------- ---------------------------------------------------------
F F F F F F -Dcc=gcc
F F F F F F -Dcc=gcc -Duse64bitint
F F F F F F -Dcc=gcc -Duselongdouble
F F F F F F -Dcc=gcc -Dusemorebits
F F F F F F -Dcc=gcc -Duseithreads
F F F F F F -Dcc=gcc -Duseithreads -Duse64bitint
F F F F F F -Dcc=gcc -Duseithreads -Duselongdouble
F F F F F F -Dcc=gcc -Duseithreads -Dusemorebits
F F F F F F -Dcc=g++
F F F M - - -Dcc=g++ -Duse64bitint
F F F F F F -Dcc=g++ -Duselongdouble
F F F F F F -Dcc=g++ -Dusemorebits
F F F F F F -Dcc=g++ -Duseithreads
F F F F F F -Dcc=g++ -Duseithreads -Duse64bitint
F F F F F F -Dcc=g++ -Duseithreads -Duselongdouble
F F F F F F -Dcc=g++ -Duseithreads -Dusemorebits
| | | | | +- LC_ALL = en_US.utf8 -DDEBUGGING
| | | | +--- PERLIO = perlio -DDEBUGGING
| | | +----- PERLIO = stdio  -DDEBUGGING
| | +------- LC_ALL = en_US.utf8
| +--------- PERLIO = perlio
+----------- PERLIO = stdio 

Locally applied patches:
    uncommitted-changes
    SMOKE9b463b21d3655b79309f8b461042cebb5733c54e

Failures: (common-args) none
[stdio/perlio/en_US.utf8] -Dcc=gcc
[stdio/en_US.utf8] -DDEBUGGING -Dcc=gcc
[stdio/perlio/en_US.utf8] -Dcc=gcc -Duse64bitint
[stdio/perlio/en_US.utf8] -DDEBUGGING -Dcc=gcc -Duse64bitint
[stdio/perlio/en_US.utf8] -Dcc=gcc -Duselongdouble
[stdio/perlio/en_US.utf8] -DDEBUGGING -Dcc=gcc -Duselongdouble
[stdio/perlio/en_US.utf8] -Dcc=gcc -Dusemorebits
[stdio/perlio/en_US.utf8] -DDEBUGGING -Dcc=gcc -Dusemorebits
[stdio/perlio/en_US.utf8] -Dcc=gcc -Duseithreads
[stdio/perlio/en_US.utf8] -DDEBUGGING -Dcc=gcc -Duseithreads
[stdio/perlio/en_US.utf8] -Dcc=gcc -Duseithreads -Duse64bitint
[stdio/perlio/en_US.utf8] -DDEBUGGING -Dcc=gcc -Duseithreads -Duse64bitint
[stdio/perlio/en_US.utf8] -Dcc=gcc -Duseithreads -Duselongdouble
[stdio/perlio/en_US.utf8] -DDEBUGGING -Dcc=gcc -Duseithreads -Duselongdouble
[stdio/perlio/en_US.utf8] -Dcc=gcc -Duseithreads -Dusemorebits
[stdio/perlio/en_US.utf8] -DDEBUGGING -Dcc=gcc -Duseithreads -Dusemorebits
[stdio/perlio/en_US.utf8] -Dcc=g++
[stdio/perlio/en_US.utf8] -DDEBUGGING -Dcc=g++
[stdio/perlio/en_US.utf8] -Dcc=g++ -Duse64bitint
[stdio/perlio/en_US.utf8] -Dcc=g++ -Duselongdouble
[perlio/en_US.utf8] -DDEBUGGING -Dcc=g++ -Duselongdouble
[stdio/perlio/en_US.utf8] -Dcc=g++ -Dusemorebits
[stdio/perlio/en_US.utf8] -DDEBUGGING -Dcc=g++ -Dusemorebits
[stdio/perlio/en_US.utf8] -Dcc=g++ -Duseithreads
[stdio/perlio/en_US.utf8] -DDEBUGGING -Dcc=g++ -Duseithreads
[stdio/perlio/en_US.utf8] -Dcc=g++ -Duseithreads -Duse64bitint
[stdio/perlio/en_US.utf8] -DDEBUGGING -Dcc=g++ -Duseithreads -Duse64bitint
[stdio/perlio/en_US.utf8] -Dcc=g++ -Duseithreads -Duselongdouble
[stdio/perlio/en_US.utf8] -DDEBUGGING -Dcc=g++ -Duseithreads -Duselongdouble
[stdio/perlio/en_US.utf8] -Dcc=g++ -Duseithreads -Dusemorebits
[stdio/perlio/en_US.utf8] -DDEBUGGING -Dcc=g++ -Duseithreads -Dusemorebits
    ../t/porting/test_bootstrap.t...............................FAILED
        316

[perlio] -DDEBUGGING -Dcc=gcc
[stdio] -DDEBUGGING -Dcc=g++ -Duselongdouble
    ../t/porting/test_bootstrap.t...............................FAILED
        316
Inconsistent test results (between TEST and harness):
    ../lib/Benchmark.t......................FAILED at test 13

[minitest] -DDEBUGGING -Dcc=g++ -Duse64bitint
    t/comp/hints....................FAILED--expected 24 tests, saw 10
    t/run/fresh_perl................FAILED at test 76
    t/run/switchx...................FAILED--no leader found
    t/io/argv.......................FAILED--no leader found
    t/io/fs.........................FAILED--no leader found
    t/io/utf8.......................FAILED--expected 55 tests, saw 52
    t/re/pat........................FAILED--no leader found
    t/re/pat_advanced...............FAILED--no leader found
    t/re/pat_psycho.................FAILED--no leader found
    t/re/pat_re_eval................FAILED--no leader found
    t/re/pat_rt_report..............FAILED--no leader found
    t/re/pat_special_cc.............FAILED--no leader found
    t/re/reg_fold...................FAILED at test 2
    t/re/reg_mesg...................FAILED at test 43
    t/re/reg_posixcc................FAILED--non-zero wait status: 512
    t/re/regexp.....................FAILED at test 98
    t/re/regexp_noamp...............FAILED at test 98
    t/re/regexp_notrie..............FAILED at test 98
    t/re/regexp_qr..................FAILED at test 98
    t/re/regexp_qr_embed............FAILED at test 98
    t/re/regexp_trielist............FAILED at test 98
    t/re/regexp_unicode_prop........FAILED--no leader found
    t/re/uniprops...................FAILED--no leader found
    t/op/chdir......................FAILED--no leader found
    t/op/die........................FAILED at test 14
    t/op/filehandle.................FAILED--no leader found
    t/op/fork.......................FAILED at test 10
    t/op/groups.....................FAILED--no leader found
    t/op/hash.......................FAILED--no leader found
    t/op/inccode-tie................FAILED--no leader found
    t/op/inccode....................FAILED--no leader found
    t/op/lc.........................FAILED--expected 93 tests, saw 25
    t/op/local......................FAILED at test 294
    t/op/magic......................FAILED at test 27
    t/op/method.....................FAILED--no leader found
    t/op/mkdir......................FAILED--no leader found
    t/op/my_stash...................FAILED--no leader found
    t/op/override...................FAILED at test 26
    t/op/pack.......................FAILED--no leader found
    t/op/readline...................FAILED--no leader found
    t/op/ref........................FAILED--expected 196 tests, saw 118
    t/op/smartmatch.................FAILED--no leader found
    t/op/split......................FAILED--no leader found
    t/op/sprintf2...................FAILED at test 1320
    t/op/stat.......................FAILED--no leader found
    t/op/switch.....................FAILED--expected 132 tests, saw 138
    t/op/taint......................FAILED--no leader found
    t/op/tie........................FAILED at test 2
    t/op/tiehandle..................FAILED--no leader found
    t/op/universal..................FAILED--no leader found
    t/op/utf8magic..................FAILED--no leader found
    t/op/utfhash....................FAILED--expected 99 tests, saw 38
    t/op/utftaint...................FAILED--no leader found
    t/uni/cache.....................FAILED--expected 1 tests, saw 0
    t/uni/class.....................FAILED--expected 10 tests, saw 0
    t/uni/fold......................FAILED--no leader found
    t/uni/lex_utf8..................FAILED--no leader found
    t/uni/lower.....................FAILED--no leader found
    t/uni/overload..................FAILED--expected 215 tests, saw 10
    t/uni/title.....................FAILED--no leader found
    t/uni/upper.....................FAILED--no leader found

Compiler messages(gcc):
try.c: In function ‘main’:
try.c:36: warning: ignoring return value of ‘pipe’, declared with attribute warn_unused_result
try.c:37: warning: ignoring return value of ‘pipe’, declared with attribute warn_unused_result
try.c:53: warning: ignoring return value of ‘write’, declared with attribute warn_unused_result
try.c:66: warning: ignoring return value of ‘write’, declared with attribute warn_unused_result
try.c:72: warning: ignoring return value of ‘write’, declared with attribute warn_unused_result
try.c:78: warning: ignoring return value of ‘read’, declared with attribute warn_unused_result
toke.c: In function ‘S_scan_const’:
toke.c:3271: warning: field precision should have type ‘int’, but argument 3 has type ‘long int’
toke.c:3271: warning: field precision should have type ‘int’, but argument 5 has type ‘long int’
util.c: In function ‘S_write_no_mem’:
util.c:67: warning: ignoring return value of ‘write’, declared with attribute warn_unused_result
sv.c: In function ‘Perl_sv_2pv_flags’:
sv.c:2755: warning: ignoring return value of ‘gcvt’, declared with attribute warn_unused_result
sv.c:2948: warning: ignoring return value of ‘gcvt’, declared with attribute warn_unused_result
sv.c: In function ‘Perl_sv_vcatpvfn’:
sv.c:9402: warning: ignoring return value of ‘gcvt’, declared with attribute warn_unused_result
sv.c:10207: warning: ignoring return value of ‘gcvt’, declared with attribute warn_unused_result
doio.c: In function ‘Perl_nextargv’:
doio.c:871: warning: ignoring return value of ‘fchown’, declared with attribute warn_unused_result
doio.c: In function ‘S_exec_failed’:
doio.c:1381: warning: ignoring return value of ‘write’, declared with attribute warn_unused_result
perlio.c: In function ‘PerlIO_debug’:
perlio.c:517: warning: ignoring return value of ‘write’, declared with attribute warn_unused_result
perlio.c: In function ‘S_more_refcounted_fds’:
perlio.c:2301: warning: ignoring return value of ‘write’, declared with attribute warn_unused_result
Dumper.xs: In function ‘DD_dump’:
Dumper.xs:813: warning: format ‘%ld’ expects type ‘long int’, but argument 2 has type ‘U32’
Call.xs: In function ‘filter_call’:
Call.xs:63: warning: format ‘%d’ expects type ‘int’, but argument 3 has type ‘STRLEN’
Call.xs:63: warning: format ‘%d’ expects type ‘int’, but argument 5 has type ‘STRLEN’
Call.xs:100: warning: format ‘%d’ expects type ‘int’, but argument 4 has type ‘STRLEN’
Call.xs:156: warning: format ‘%d’ expects type ‘int’, but argument 3 has type ‘STRLEN’
Call.xs:175: warning: format ‘%d’ expects type ‘int’, but argument 4 has type ‘STRLEN’
sdbm.c: In function ‘makroom’:
sdbm.c:371: warning: ignoring return value of ‘write’, declared with attribute warn_unused_result
APItest.xs: In function ‘XS_XS__APItest_pmflag’:
APItest.xs:930: warning: ‘Perl_pmflag’ is deprecated (declared at ../../proto.h:2627)
sv.c:2755: warning: ignoring return value of ‘qgcvt’, declared with attribute warn_unused_result
sv.c:2948: warning: ignoring return value of ‘qgcvt’, declared with attribute warn_unused_result
sv.c:10207: warning: ignoring return value of ‘qgcvt’, declared with attribute warn_unused_result
pp_sys.c: In function ‘Perl_pp_gmtime’:
pp_sys.c:4527: warning: format ‘%.0f’ expects type ‘double’, but argument 4 has type ‘Time64_T’
pp_sys.c:4532: warning: format ‘%.0f’ expects type ‘double’, but argument 4 has type ‘Time64_T’
toke.c:3271: warning: field precision should have type ‘int’, but argument 4 has type ‘long int’
toke.c:3271: warning: field precision should have type ‘int’, but argument 6 has type ‘long int’
perlio.c:508: warning: ignoring return value of ‘write’, declared with attribute warn_unused_result
perl.c: In function ‘S_init_tls_and_interp’:
perl.c:107: warning: ignoring return value of ‘write’, declared with attribute warn_unused_result
threads.xs: In function ‘S_ithread_create’:
threads.xs:701: warning: ignoring return value of ‘write’, declared with attribute warn_unused_result
pp_sys.c:4527: warning: format ‘%.0f’ expects type ‘double’, but argument 5 has type ‘Time64_T’
pp_sys.c:4532: warning: format ‘%.0f’ expects type ‘double’, but argument 5 has type ‘Time64_T’
try.c: In function ‘int main()’:
try.c:36: warning: ignoring return value of ‘int pipe(int*)’, declared with attribute warn_unused_result
try.c:37: warning: ignoring return value of ‘int pipe(int*)’, declared with attribute warn_unused_result
try.c:53: warning: ignoring return value of ‘ssize_t write(int, const void*, size_t)’, declared with attribute warn_unused_result
try.c:66: warning: ignoring return value of ‘ssize_t write(int, const void*, size_t)’, declared with attribute warn_unused_result
try.c:72: warning: ignoring return value of ‘ssize_t write(int, const void*, size_t)’, declared with attribute warn_unused_result
try.c:78: warning: ignoring return value of ‘ssize_t read(int, void*, size_t)’, declared with attribute warn_unused_result
toke.c: In function ‘char* S_scan_const(char*)’:
util.c: In function ‘char* S_write_no_mem()’:
util.c:68: warning: ignoring return value of ‘ssize_t write(int, const void*, size_t)’, declared with attribute warn_unused_result
mg.c: In function ‘int Perl_magic_get(SV*, MAGIC*)’:
mg.c:999: warning: deprecated conversion from string constant to ‘char*’
mg.c:1011: warning: deprecated conversion from string constant to ‘char*’
sv.c: In function ‘char* Perl_sv_2pv_flags(SV*, STRLEN*, I32)’:
sv.c:2755: warning: ignoring return value of ‘char* gcvt(double, int, char*)’, declared with attribute warn_unused_result
sv.c:2948: warning: ignoring return value of ‘char* gcvt(double, int, char*)’, declared with attribute warn_unused_result
sv.c: In function ‘void Perl_sv_vcatpvfn(SV*, const char*, STRLEN, __va_list_tag (*)[1], SV**, I32, bool*)’:
sv.c:9402: warning: ignoring return value of ‘char* gcvt(double, int, char*)’, declared with attribute warn_unused_result
sv.c:10207: warning: ignoring return value of ‘char* gcvt(double, int, char*)’, declared with attribute warn_unused_result
doio.c: In function ‘PerlIOl** Perl_nextargv(GV*)’:
doio.c:871: warning: ignoring return value of ‘int fchown(int, __uid_t, __gid_t)’, declared with attribute warn_unused_result
doio.c: In function ‘void S_exec_failed(const char*, int, int)’:
doio.c:1381: warning: ignoring return value of ‘ssize_t write(int, const void*, size_t)’, declared with attribute warn_unused_result
utf8.c: In function ‘STRLEN Perl_utf8_length(const U8*, const U8*)’:
utf8.c:742: warning: format not a string literal and no format arguments
perlio.c: In function ‘void PerlIO_debug(const char*, ...)’:
perlio.c:517: warning: ignoring return value of ‘ssize_t write(int, const void*, size_t)’, declared with attribute warn_unused_result
perlio.c: In function ‘void S_more_refcounted_fds(int)’:
perlio.c:2302: warning: ignoring return value of ‘ssize_t write(int, const void*, size_t)’, declared with attribute warn_unused_result
op.c: In function ‘OP* S_fold_constants(OP*)’:
op.c:2462: warning: variable ‘newop’ might be clobbered by ‘longjmp’ or ‘vfork’
Dumper.xs: In function ‘I32 DD_dump(SV*, const char*, STRLEN, SV*, HV*, AV*, I32*, I32, SV*, SV*, SV*, SV*, SV*, SV*, SV*, I32, I32, I32, SV*, I32, SV*)’:
MD5.xs: In function ‘void XS_Digest__MD5_md5(CV*)’:
MD5.xs:702: warning: deprecated conversion from string constant to ‘char*’
MD5.xs:704: warning: deprecated conversion from string constant to ‘char*’
MD5.xs:710: warning: deprecated conversion from string constant to ‘char*’
MD5.xs:715: warning: deprecated conversion from string constant to ‘char*’
Call.xs: In function ‘I32 filter_call(int, SV*, int)’:
Call.xs:175: warning: format ‘%d’ expects type ‘int’, but argument 4 has type ‘long unsigned int’
sdbm.c: In function ‘int makroom(DBM*, long int, int)’:
sdbm.c:371: warning: ignoring return value of ‘ssize_t write(int, const void*, size_t)’, declared with attribute warn_unused_result
APItest.xs: In function ‘void XS_XS__APItest_pmflag(CV*)’:
APItest.xs:930: warning: ‘void Perl_pmflag(U32*, int)’ is deprecated (declared at ../../proto.h:2627)
Call.xs:63: warning: format ‘%d’ expects type ‘int’, but argument 3 has type ‘long unsigned int’
Call.xs:63: warning: format ‘%d’ expects type ‘int’, but argument 5 has type ‘long unsigned int’
Call.xs:100: warning: format ‘%d’ expects type ‘int’, but argument 4 has type ‘long unsigned int’
Call.xs:156: warning: format ‘%d’ expects type ‘int’, but argument 3 has type ‘long unsigned int’
sv.c:2755: warning: ignoring return value of ‘char* qgcvt(long double, int, char*)’, declared with attribute warn_unused_result
sv.c:2948: warning: ignoring return value of ‘char* qgcvt(long double, int, char*)’, declared with attribute warn_unused_result
sv.c:10207: warning: ignoring return value of ‘char* qgcvt(long double, int, char*)’, declared with attribute warn_unused_result
pp_sys.c: In function ‘OP* Perl_pp_gmtime()’:
toke.c: In function ‘char* S_scan_const(PerlInterpreter*, char*)’:
util.c: In function ‘char* S_write_no_mem(PerlInterpreter*)’:
mg.c: In function ‘int Perl_magic_get(PerlInterpreter*, SV*, MAGIC*)’:
sv.c: In function ‘char* Perl_sv_2pv_flags(PerlInterpreter*, SV*, STRLEN*, I32)’:
sv.c: In function ‘void Perl_sv_vcatpvfn(PerlInterpreter*, SV*, const char*, STRLEN, __va_list_tag (*)[1], SV**, I32, bool*)’:
doio.c: In function ‘PerlIOl** Perl_nextargv(PerlInterpreter*, GV*)’:
doio.c: In function ‘void S_exec_failed(PerlInterpreter*, const char*, int, int)’:
utf8.c: In function ‘STRLEN Perl_utf8_length(PerlInterpreter*, const U8*, const U8*)’:
perlio.c:508: warning: ignoring return value of ‘ssize_t write(int, const void*, size_t)’, declared with attribute warn_unused_result
perlio.c: In function ‘void S_more_refcounted_fds(PerlInterpreter*, int)’:
perl.c: In function ‘void S_init_tls_and_interp(PerlInterpreter*)’:
perl.c:107: warning: ignoring return value of ‘ssize_t write(int, const void*, size_t)’, declared with attribute warn_unused_result
op.c: In function ‘OP* S_fold_constants(PerlInterpreter*, OP*)’:
Dumper.xs: In function ‘I32 DD_dump(PerlInterpreter*, SV*, const char*, STRLEN, SV*, HV*, AV*, I32*, I32, SV*, SV*, SV*, SV*, SV*, SV*, SV*, I32, I32, I32, SV*, I32, SV*)’:
MD5.xs: In function ‘void XS_Digest__MD5_md5(PerlInterpreter*, CV*)’:
Call.xs: In function ‘I32 filter_call(PerlInterpreter*, int, SV*, int)’:
APItest.xs: In function ‘void XS_XS__APItest_pmflag(PerlInterpreter*, CV*)’:
APItest.xs:930: warning: ‘void Perl_pmflag(PerlInterpreter*, U32*, int)’ is deprecated (declared at ../../proto.h:2627)
shared.xs: In function ‘user_lock* S_get_userlock(PerlInterpreter*, SV*, bool)’:
shared.xs:345: warning: deprecated conversion from string constant to ‘char*’
shared.xs: In function ‘void S_sharedsv_dec(PerlInterpreter*, SV*)’:
shared.xs:518: warning: deprecated conversion from string constant to ‘char*’
shared.xs: In function ‘void Perl_sharedsv_share(PerlInterpreter*, SV*)’:
shared.xs:547: warning: deprecated conversion from string constant to ‘char*’
shared.xs: In function ‘int sharedsv_scalar_mg_get(PerlInterpreter*, SV*, MAGIC*)’:
shared.xs:713: warning: deprecated conversion from string constant to ‘char*’
shared.xs: In function ‘int sharedsv_scalar_mg_set(PerlInterpreter*, SV*, MAGIC*)’:
shared.xs:791: warning: deprecated conversion from string constant to ‘char*’
shared.xs: In function ‘int sharedsv_scalar_mg_local(PerlInterpreter*, SV*, MAGIC*)’:
shared.xs:832: warning: deprecated conversion from string constant to ‘char*’
shared.xs: In function ‘int sharedsv_elem_mg_FETCH(PerlInterpreter*, SV*, MAGIC*)’:
shared.xs:869: warning: deprecated conversion from string constant to ‘char*’
shared.xs: In function ‘int sharedsv_elem_mg_STORE(PerlInterpreter*, SV*, MAGIC*)’:
shared.xs:927: warning: deprecated conversion from string constant to ‘char*’
shared.xs: In function ‘int sharedsv_elem_mg_DELETE(PerlInterpreter*, SV*, MAGIC*)’:
shared.xs:969: warning: deprecated conversion from string constant to ‘char*’
shared.xs: In function ‘U32 sharedsv_array_mg_FETCHSIZE(PerlInterpreter*, SV*, MAGIC*)’:
shared.xs:1030: warning: deprecated conversion from string constant to ‘char*’
shared.xs: In function ‘int sharedsv_array_mg_CLEAR(PerlInterpreter*, SV*, MAGIC*)’:
shared.xs:1048: warning: deprecated conversion from string constant to ‘char*’
shared.xs: In function ‘void Perl_sharedsv_lock(PerlInterpreter*, SV*)’:
shared.xs:1134: warning: deprecated conversion from string constant to ‘char*’
shared.xs: In function ‘void XS_threads__shared__tie_PUSH(PerlInterpreter*, CV*)’:
shared.xs:1206: warning: deprecated conversion from string constant to ‘char*’
shared.xs: In function ‘void XS_threads__shared__tie_UNSHIFT(PerlInterpreter*, CV*)’:
shared.xs:1223: warning: deprecated conversion from string constant to ‘char*’
shared.xs: In function ‘void XS_threads__shared__tie_POP(PerlInterpreter*, CV*)’:
shared.xs:1246: warning: deprecated conversion from string constant to ‘char*’
shared.xs: In function ‘void XS_threads__shared__tie_SHIFT(PerlInterpreter*, CV*)’:
shared.xs:1263: warning: deprecated conversion from string constant to ‘char*’
shared.xs: In function ‘void XS_threads__shared__tie_EXTEND(PerlInterpreter*, CV*)’:
shared.xs:1279: warning: deprecated conversion from string constant to ‘char*’
shared.xs: In function ‘void XS_threads__shared__tie_STORESIZE(PerlInterpreter*, CV*)’:
shared.xs:1289: warning: deprecated conversion from string constant to ‘char*’
shared.xs: In function ‘void XS_threads__shared__tie_EXISTS(PerlInterpreter*, CV*)’:
shared.xs:1301: warning: deprecated conversion from string constant to ‘char*’
shared.xs:1311: warning: deprecated conversion from string constant to ‘char*’
shared.xs: In function ‘void XS_threads__shared__tie_FIRSTKEY(PerlInterpreter*, CV*)’:
shared.xs:1327: warning: deprecated conversion from string constant to ‘char*’
shared.xs: In function ‘void XS_threads__shared__tie_NEXTKEY(PerlInterpreter*, CV*)’:
shared.xs:1355: warning: deprecated conversion from string constant to ‘char*’
shared.xs: In function ‘void XS_threads__shared_bless(PerlInterpreter*, CV*)’:
shared.xs:1615: warning: deprecated conversion from string constant to ‘char*’
threads.xs: In function ‘ithread* S_ithread_create(PerlInterpreter*, SV*, IV, int, int, SV*)’:
threads.xs:701: warning: ignoring return value of ‘ssize_t write(int, const void*, size_t)’, declared with attribute warn_unused_result
pp_sys.c: In function ‘OP* Perl_pp_gmtime(PerlInterpreter*)’:

-- 
Report by Test::Smoke v1.42 build 1267 running on perl 5.10.0
(Reporter v0.035 / Smoker v0.045)




nntp.perl.org: Perl Programming lists via nntp and http.
Comments to Ask Bjørn Hansen at ask@perl.org | Group listing | About