develooper Front page | perl.perl5.porters | Postings from April 2010

Smoke [5.13.0] v5.12.0-58-gb770e14 FAIL(F) MSWin32 Win2000 SP4 (x86/2 cpu)

From:
George Greer
Date:
April 15, 2010 17:09
Subject:
Smoke [5.13.0] v5.12.0-58-gb770e14 FAIL(F) MSWin32 Win2000 SP4 (x86/2 cpu)
Message ID:
201004160009.o3G09UVb004035@m-l.org
Automated smoke report for 5.13.0 patch b770e143548c6091e84d4ed5051d27d26e0f82e8 v5.12.0-58-gb770e14
perl-win2k: Intel(R) Core(TM) i7 CPU 920 @ 2.67GHz(~2671 MHz) (x86/2 cpu)
    on        MSWin32 - Win2000 SP4
    using     cl version 14.00.50727.762
    smoketime 10 hours 29 minutes (average 1 hour 18 minutes)

Summary: FAIL(F)

O = OK  F = Failure(s), extended report at the bottom
X = Failure(s) under TEST but not under harness
? = still running or test results not (yet) available
Build failures during:       - = unknown or N/A
c = Configure, m = make, M = make (after miniperl), t = make test-prep

v5.12.0-58-gb770e14  Configuration (common) none
----------- ---------------------------------------------------------
O F         
F F         -Duselargefiles
F F         -Duseithreads
O F         -Duseithreads -Duselargefiles
| +--------- -DDEBUGGING
+----------- no debugging


Locally applied patches:
    uncommitted-changes
    SMOKEb770e143548c6091e84d4ed5051d27d26e0f82e8

Failures: (common-args) none
[default] -DDEBUGGING
[default] -DDEBUGGING -Duseithreads -Duselargefiles
../t/op/sselect.t...........................................FAILED
    10

[default] -Duselargefiles
../cpan/Time-HiRes/t/HiRes.t................................FAILED
    11

[default] -DDEBUGGING -Duselargefiles
../t/op/sselect.t...........................................FAILED
    11

[default] -Duseithreads
../dist/IO/t/io_sock.t......................................FAILED
    25
    Non-zero exit status: 255

[default] -DDEBUGGING -Duseithreads
../dist/Thread-Semaphore/t/01_basic.t.......................FAILED
    Non-zero exit status: 1
    Bad plan.  You planned 10 tests but ran 5.

Compiler messages(MSWin32):
Cwd.xs(75) : warning C4101: 'symlink' : unreferenced local variable

-- 
Report by Test::Smoke v1.42 build 1267 running on perl 5.10.0
(Reporter v0.035 / Smoker v0.045)




nntp.perl.org: Perl Programming lists via nntp and http.
Comments to Ask Bjørn Hansen at ask@perl.org | Group listing | About