develooper Front page | perl.perl5.porters | Postings from April 2010

Smoke [5.12.0] v5.12.0 FAIL(F) MSWin32 Win2000 SP4 (x86/2 cpu)

From:
George Greer
Date:
April 12, 2010 22:14
Subject:
Smoke [5.12.0] v5.12.0 FAIL(F) MSWin32 Win2000 SP4 (x86/2 cpu)
Message ID:
201004130514.o3D5EWxQ018083@m-l.org
Automated smoke report for 5.12.0 patch 6d52c880307229a35c23215c596700e716bd7c32 v5.12.0
perl-win2k: Intel(R) Core(TM) i7 CPU 920 @ 2.67GHz(~2671 MHz) (x86/2 cpu)
    on        MSWin32 - Win2000 SP4
    using     cl version 14.00.50727.762
    smoketime 4 hours 13 minutes (average 31 minutes 41 seconds)

Summary: FAIL(F)

O = OK  F = Failure(s), extended report at the bottom
X = Failure(s) under TEST but not under harness
? = still running or test results not (yet) available
Build failures during:       - = unknown or N/A
c = Configure, m = make, M = make (after miniperl), t = make test-prep

  v5.12.0    Configuration (common) none
----------- ---------------------------------------------------------
O O         
O F         -Duselargefiles
F F         -Duseithreads
O O         -Duseithreads -Duselargefiles
| +--------- -DDEBUGGING
+----------- no debugging


Locally applied patches:
    uncommitted-changes
    SMOKE6d52c880307229a35c23215c596700e716bd7c32

Failures: (common-args) none
[default] -DDEBUGGING -Duselargefiles
../t/op/sselect.t...........................................FAILED
    10

[default] -Duseithreads
../dist/IO/t/io_sock.t......................................FAILED
    25
    Non-zero exit status: 255
    Bad plan.  You planned 26 tests but ran 25.

[default] -DDEBUGGING -Duseithreads
../t/op/sselect.t...........................................FAILED
    10-11

Compiler messages(MSWin32):
Cwd.xs(75) : warning C4101: 'symlink' : unreferenced local variable

-- 
Report by Test::Smoke v1.42 build 1267 running on perl 5.10.0
(Reporter v0.035 / Smoker v0.045)




nntp.perl.org: Perl Programming lists via nntp and http.
Comments to Ask Bjørn Hansen at ask@perl.org | Group listing | About