develooper Front page | perl.perl5.porters | Postings from April 2010

Smoke [5.12.0] v5.12.0-RC5-1-g675ac12 FAIL(XF) netbsd 5.0.2 (i386/1 cpu)

From:
Steven Schubiger
Date:
April 11, 2010 21:06
Subject:
Smoke [5.12.0] v5.12.0-RC5-1-g675ac12 FAIL(XF) netbsd 5.0.2 (i386/1 cpu)
Message ID:
4bc29c46.9804cc0a.2462.ffffdc6b@mx.google.com
Automated smoke report for 5.12.0 patch 675ac12c19e6fe00eff6e604a7d637bf621997ef v5.12.0-RC5-1-g675ac12
p5netbsd: Intel 686-class (i386/1 cpu)
    on        netbsd - 5.0.2
    using     cc version 4.1.3 20080704 prerelease (NetBSD nb2 20081120)
    smoketime 6 hours 36 minutes (average 49 minutes 36 seconds)

Summary: FAIL(XF)

O = OK  F = Failure(s), extended report at the bottom
X = Failure(s) under TEST but not under harness
? = still running or test results not (yet) available
Build failures during:       - = unknown or N/A
c = Configure, m = make, M = make (after miniperl), t = make test-prep

v5.12.0-RC5-1-g675ac12  Configuration (common) none
----------- ---------------------------------------------------------
O X O O     
O O O O     -Duse64bitint
X O O O     -Duseithreads
O X X F     -Duseithreads -Duse64bitint
| | | +----- PERLIO = perlio -DDEBUGGING
| | +------- PERLIO = stdio  -DDEBUGGING
| +--------- PERLIO = perlio
+----------- PERLIO = stdio


Locally applied patches:
    RC5
    uncommitted-changes
    SMOKE675ac12c19e6fe00eff6e604a7d637bf621997ef

Failures: (common-args) none
[perlio] 
[stdio] -Duseithreads
Inconsistent test results (between TEST and harness):
    ../lib/Benchmark.t......................FAILED at test 127

[perlio] -Duseithreads -Duse64bitint
[stdio] -DDEBUGGING -Duseithreads -Duse64bitint
Inconsistent test results (between TEST and harness):
    ../lib/Benchmark.t......................FAILED at test 126

[perlio] -DDEBUGGING -Duseithreads -Duse64bitint
    ../lib/Benchmark.t..........................................FAILED
        126-127
        Non-zero exit status: 2

Compiler messages(gcc):
perlio.c: In function 'PerlIOStdio_set_ptrcnt':
perlio.c:3437: warning: pointer targets in assignment differ in signedness
/usr/include/sys/cdefs_elf.h:67:20: error: missing binary operator before token "("
<command line>:1:1: warning: "TIME_HIRES_STAT" redefined
<command line>:1:1: warning: this is the location of the previous definition
APItest.xs: In function 'XS_XS__APItest_pmflag':
APItest.xs:930: warning: 'Perl_pmflag' is deprecated (declared at ../../proto.h:2622)

-- 
Report by Test::Smoke v1.43 build 1271 running on perl 5.10.1
(Reporter v0.035 / Smoker v0.045)



nntp.perl.org: Perl Programming lists via nntp and http.
Comments to Ask Bjørn Hansen at ask@perl.org | Group listing | About