develooper Front page | perl.perl5.porters | Postings from December 2009

Smoke [5.11.2] v5.11.2-170-g4342f4d FAIL(F) openvms V8.3-1H1 (IA64/2cpu)

From:
Craig A. Berry
Date:
December 18, 2009 05:19
Subject:
Smoke [5.11.2] v5.11.2-170-g4342f4d FAIL(F) openvms V8.3-1H1 (IA64/2cpu)
Message ID:
0KUU00EBHNN3GB20@asmtp021.mac.com
Automated smoke report for 5.11.2 patch 4342f4d6df6a7dfa22a470aa21e54a5622c009f3 v5.11.2-170-g4342f4d
ALMA: HP rx2600  (1.50GHz/6.0MB) (IA64/2 cpu)
    on        openvms - V8.3-1H1
    using     ? CC/DECC version 70390018
    smoketime 15 hours 50 minutes (average 7 hours 55 minutes)

Summary: FAIL(F)

O = OK  F = Failure(s), extended report at the bottom
X = Failure(s) under TEST but not under harness
? = still running or test results not (yet) available
Build failures during:       - = unknown or N/A
c = Configure, m = make, M = make (after miniperl), t = make test-prep

v5.11.2-170-g4342f4d  Configuration (common) none
----------- ---------------------------------------------------------
F -         
F -         -Duseithreads
| +--------- -DDEBUGGING
+----------- no debugging


Locally applied patches:
    SMOKE4342f4d6df6a7dfa22a470aa21e54a5622c009f3

Failures: (common-args) none
[default] 
    t/io/errno.....................................................FAILED at test 2
    t/io/inplace...................................................FAILED--unexpected output at test 4
    t/re/reg_posixcc...............................................FAILED--unexpected output at test 1507
    t/op/filetest_t................................................FAILED at test 1
    t/op/ref.......................................................FAILED at test 117
    cpan/ExtUtils-CBuilder/t/02-link...............................FAILED at test 8
    cpan/Module-Build/t/basic......................................FAILED at test 6
    cpan/Module-Build/t/compat.....................................FAILED at test 142
    cpan/Module-Build/t/install_extra_target.......................FAILED at test 4
    cpan/Module-Build/t/properties/module_name.....................FAILED at test 2
    cpan/Module-Build/t/properties/share_dir.......................FAILED at test 14
    cpan/Pod-Parser/t/pod/find.....................................FAILED--expected 4 tests, saw 1
    dist/base/t/fields-5.6.0.......................................FAILED--no leader found
    dist/base/t/fields-5.8.0.......................................FAILED--no leader found
    dist/ExtUtils-Install/t/InstallWithMM..........................FAILED at test 3
    t/porting/diag.................................................FAILED--unexpected output at test 0

[default] -Duseithreads
    t/io/errno.....................................................FAILED at test 2
    t/io/inplace...................................................FAILED--unexpected output at test 4

-- 
Report by Test::Smoke v1.39 build 1235 running on perl 5.10.0
(Reporter v0.035 / Smoker v0.044)



nntp.perl.org: Perl Programming lists via nntp and http.
Comments to Ask Bjørn Hansen at ask@perl.org | Group listing | About