develooper Front page | perl.perl5.porters | Postings from December 2009

Smoke [5.11.2] v5.11.2-138-gbb61cbb FAIL(F) openbsd 4.6 (i386/1 cpu)

From:
Steven Schubiger
Date:
December 9, 2009 06:03
Subject:
Smoke [5.11.2] v5.11.2-138-gbb61cbb FAIL(F) openbsd 4.6 (i386/1 cpu)
Message ID:
4b1fae0f.0c07560a.046c.03c6@mx.google.com
Automated smoke report for 5.11.2 patch bb61cbbfe4f34b8082fca34dd9dd82cae6aaa146 v5.11.2-138-gbb61cbb
p5openbsd: AMD Athlon(tm) Processor ("AuthenticAMD" 686-class, 256KB L2 cache) (909 MHz) (i386/1 cpu)
    on        openbsd - 4.6
    using     cc version 3.3.5 (propolice)
    smoketime 14 hours 42 minutes (average 1 hour 50 minutes)

Summary: FAIL(F)

O = OK  F = Failure(s), extended report at the bottom
X = Failure(s) under TEST but not under harness
? = still running or test results not (yet) available
Build failures during:       - = unknown or N/A
c = Configure, m = make, M = make (after miniperl), t = make test-prep

v5.11.2-138-gbb61cbb  Configuration (common) none
----------- ---------------------------------------------------------
F F F F     
F F F F     -Duse64bitint
F F F F     -Duseithreads
F F F F     -Duseithreads -Duse64bitint
| | | +----- PERLIO = perlio -DDEBUGGING
| | +------- PERLIO = stdio  -DDEBUGGING
| +--------- PERLIO = perlio
+----------- PERLIO = stdio


Locally applied patches:
    SMOKEbb61cbbfe4f34b8082fca34dd9dd82cae6aaa146

Failures: (common-args) none
[stdio/perlio] 
[stdio/perlio] -DDEBUGGING
[stdio/perlio] -Duse64bitint
[stdio/perlio] -DDEBUGGING -Duse64bitint
[stdio/perlio] -Duseithreads
[stdio/perlio] -DDEBUGGING -Duseithreads
[perlio] -Duseithreads -Duse64bitint
[perlio] -DDEBUGGING -Duseithreads -Duse64bitint
    ../lib/File/Copy.t..........................................FAILED
        Bad plan.  You planned 461 tests but ran 82.

[stdio] -Duseithreads -Duse64bitint
    ../lib/File/Copy.t..........................................FAILED
        Bad plan.  You planned 461 tests but ran 82.
Inconsistent test results (between TEST and harness):
    ../t/io/errno.t.........................FAILED at test 9

[stdio] -DDEBUGGING -Duseithreads -Duse64bitint
    ../lib/File/Copy.t..........................................FAILED
        Bad plan.  You planned 461 tests but ran 82.
Inconsistent test results (between TEST and harness):
    ../t/io/errno.t.........................FAILED at test 10

Compiler messages(gcc):
Configure .../tmp//ccoo8ROd.o(.text+0x3e): In function `main':
/tmp//ccb5bse2.o(.text+0x5d): In function `main':
/tmp//ccNAtH8v.o(.text+0x1c): In function `xxx':
/tmp//ccPPvc8I.o(.text+0xde): In function `main':
sv.o(.text+0x1d5f): In function `Perl_sv_2pv_flags':
libperl.a(DynaLoader.o)(.text+0x242): In function `XS_DynaLoader_dl_load_file':
libperl.a(sv.o)(.text+0x1d5f): In function `Perl_sv_2pv_flags':
<command line>:12:1: warning: "TIME_HIRES_STAT" redefined
<command line>:11:1: warning: this is the location of the previous definition
<command line>:13:1: warning: "TIME_HIRES_STAT" redefined
<command line>:12:1: warning: this is the location of the previous definition
APItest.xs: In function `XS_XS__APItest_pmflag':
APItest.xs:930: warning: `Perl_pmflag' is deprecated (declared at ../../proto.h:2550)
util.o(.text+0x1b3): In function `savestr':
str.o(.text+0x5d): In function `str_2ptr':
../libperl.a(sv.o)(.text+0x1d5f): In function `Perl_sv_2pv_flags':
Configure .../tmp//ccSkixVu.o(.text+0x3e): In function `main':
/home/sts/source/p5-current/UU/try.c:20: warning: sprintf() is often misused, please use snprintf()
/tmp//ccvKGsRq.o(.text+0x5d): In function `main':
/home/sts/source/p5-current/UU/try.c:29: warning: sprintf() is often misused, please use snprintf()
/tmp//ccwYCb89.o(.text+0x1c): In function `xxx':
/home/sts/source/p5-current/UU/try.c:29: warning: vsprintf() is often misused, please use vsnprintf()
/tmp//ccCq757t.o(.text+0xde): In function `main':
/home/sts/source/p5-current/UU/try.c:52: warning: sprintf() is often misused, please use snprintf()
sv.o(.text+0xbb13): In function `Perl_sv_2pv_flags':
/home/sts/source/p5-current/sv.c:2769: warning: sprintf() is often misused, please use snprintf()
libperl.a(DynaLoader.o)(.text+0x572): In function `XS_DynaLoader_dl_load_file':
/home/sts/source/p5-current/ext/DynaLoader/DynaLoader.xs:171: warning: strcat() is almost always misused, please use strlcat()
libperl.a(sv.o)(.text+0xbb13): In function `Perl_sv_2pv_flags':
<command line>:14:1: warning: "TIME_HIRES_STAT" redefined
<command line>:13:1: warning: this is the location of the previous definition
<command line>:15:1: warning: "TIME_HIRES_STAT" redefined
<command line>:14:1: warning: this is the location of the previous definition
util.o(.text+0x283): In function `savestr':
/home/sts/source/p5-current/x2p/util.c:147: warning: strcpy() is almost always misused, please use strlcpy()
str.o(.text+0x81): In function `str_2ptr':
/home/sts/source/p5-current/x2p/str.c:32: warning: sprintf() is often misused, please use snprintf()
../libperl.a(sv.o)(.text+0xbb13): In function `Perl_sv_2pv_flags':
Configure .../tmp//cc7F2dTi.o(.text+0x3e): In function `main':
/tmp//ccGz2jgA.o(.text+0x5d): In function `main':
/tmp//ccIz0YYE.o(.text+0x1c): In function `xxx':
/tmp//ccyJ75xX.o(.text+0xde): In function `main':
sv.o(.text+0x2223): In function `Perl_sv_2pv_flags':
libperl.a(sv.o)(.text+0x2223): In function `Perl_sv_2pv_flags':
../libperl.a(sv.o)(.text+0x2223): In function `Perl_sv_2pv_flags':
Configure .../tmp//ccP7kCux.o(.text+0x3e): In function `main':
/tmp//ccsorRC1.o(.text+0x5d): In function `main':
/tmp//ccpYwkck.o(.text+0x1c): In function `xxx':
/tmp//cc7eGyy4.o(.text+0xde): In function `main':
sv.o(.text+0xafb2): In function `Perl_sv_2pv_flags':
libperl.a(sv.o)(.text+0xafb2): In function `Perl_sv_2pv_flags':
../libperl.a(sv.o)(.text+0xafb2): In function `Perl_sv_2pv_flags':
Configure .../tmp//ccD86AEX.o(.text+0x3e): In function `main':
/tmp//cc543Nbo.o(.text+0x5d): In function `main':
/tmp//ccoKfcLD.o(.text+0x1c): In function `xxx':
/tmp//cc2hWI9d.o(.text+0xde): In function `main':
sv.o(.text+0x1eb3): In function `Perl_sv_2pv_flags':
libperl.a(DynaLoader.o)(.text+0x4aa): In function `XS_DynaLoader_dl_load_file':
libperl.a(sv.o)(.text+0x1eb3): In function `Perl_sv_2pv_flags':
../libperl.a(sv.o)(.text+0x1eb3): In function `Perl_sv_2pv_flags':
Configure .../tmp//cc6whAmV.o(.text+0x3e): In function `main':
/tmp//ccia1PPJ.o(.text+0x5d): In function `main':
/tmp//ccUrs8TL.o(.text+0x1c): In function `xxx':
/tmp//cca9F3e8.o(.text+0xde): In function `main':
sv.o(.text+0xbd4f): In function `Perl_sv_2pv_flags':
libperl.a(DynaLoader.o)(.text+0x8f6): In function `XS_DynaLoader_dl_load_file':
libperl.a(sv.o)(.text+0xbd4f): In function `Perl_sv_2pv_flags':
<command line>:16:1: warning: "TIME_HIRES_STAT" redefined
<command line>:15:1: warning: this is the location of the previous definition
../libperl.a(sv.o)(.text+0xbd4f): In function `Perl_sv_2pv_flags':
Configure .../tmp//cckERrwF.o(.text+0x3e): In function `main':
/tmp//cc8HVVeu.o(.text+0x5d): In function `main':
/tmp//ccrb30SY.o(.text+0x1c): In function `xxx':
/tmp//cc6msBlR.o(.text+0xde): In function `main':
sv.o(.text+0x236b): In function `Perl_sv_2pv_flags':
libperl.a(sv.o)(.text+0x236b): In function `Perl_sv_2pv_flags':
../libperl.a(sv.o)(.text+0x236b): In function `Perl_sv_2pv_flags':
Configure .../tmp//cc8cE7cG.o(.text+0x3e): In function `main':
/tmp//cccRK2Wc.o(.text+0x5d): In function `main':
/tmp//ccVmL6hl.o(.text+0x1c): In function `xxx':
/tmp//ccaqOhvw.o(.text+0xde): In function `main':
sv.o(.text+0xb242): In function `Perl_sv_2pv_flags':
libperl.a(DynaLoader.o)(.text+0x8fa): In function `XS_DynaLoader_dl_load_file':
libperl.a(sv.o)(.text+0xb242): In function `Perl_sv_2pv_flags':
../libperl.a(sv.o)(.text+0xb242): In function `Perl_sv_2pv_flags':

-- 
Report by Test::Smoke v1.40 build 1242 running on perl 5.10.0
(Reporter v0.035 / Smoker v0.044)



nntp.perl.org: Perl Programming lists via nntp and http.
Comments to Ask Bjørn Hansen at ask@perl.org | Group listing | About