develooper Front page | perl.perl5.porters | Postings from December 2009

Re: Please test DAGOLDEN/Module-Build-0.35_13.tar.gz

From:
Craig A. Berry
Date:
December 6, 2009 20:29
Subject:
Re: Please test DAGOLDEN/Module-Build-0.35_13.tar.gz
Message ID:
c9ab31fc0912062029j273188bu6719190c5542f4cf@mail.gmail.com
On Sun, Dec 6, 2009 at 9:07 PM, David Golden <xdaveg@gmail.com> wrote:
> This is Release Candidate 3.  Unless something pops up on some
> less-commonly tested platform, I expect this to be the final release
> candidate before Module::Build 0.36.
>
> Craig B. or John M. -- I'd particularly like one more test from you on
> VMS before I release 0.36 and write a patch for blead.

Thanks for the heads up.  Below is a quick build and test, which is
not all good news, but not entirely bad news either.  This is just a
"where we are" post and I have not even looked at the test output in
any detail yet.

$ perl -v

This is perl 5, version 11, subversion 2 (v5.11.2-110-g9e95c63*) built
for VMS_IA64-ithread

Copyright 1987-2009, Larry Wall

Perl may be copied only under the terms of either the Artistic License or the
GNU General Public License, which may be found in the Perl 5 source kit.

Complete documentation for Perl, including FAQ lists, should be found on
this system using "man perl" or "perldoc perl".  If you have access to the
Internet, point your browser at http://www.perl.org/, the Perl Home Page.

$ sd [.module-build]
  D0:[CRAIG.MODULE-BUILD]
$ perl Makefile.PL
# running Build.PL

Checking optional features...
YAML_support............disabled
  requires:
    ! YAML::Tiny is not installed
license_creation........disabled
  requires:
    ! Software::License is not installed

ERRORS/WARNINGS FOUND IN PREREQUISITES.  You may wish to install the versions
of the modules indicated above before proceeding with this installation

Creating new 'MYMETA.yml' with configuration results
Creating new 'Build.com' script for 'Module-Build' version '0.35_13'
$ mmk
MCR dsa0:[craig.blead.][000000]ndbgperl.exe;3 Build.COM --makefile_env_macros 1
Building Module-Build
$ mmk test
MCR dsa0:[craig.blead.][000000]ndbgperl.exe;3 Build.COM
--makefile_env_macros 1 test

#   Failed test 'require '-::inc::latest_pm';'
#   at [.t]00-compile.t line 15.
#     Tried to require ''-::inc::latest_pm''.
#     Error:  Can't locate -::inc::latest_pm in @INC (@INC contains:
/D0/CRAIG/MODULE-BUILD/blib/lib /D0/CRAIG/MODULE-BUILD/blib/arc
h t/lib t/bundled lib ../../lib ../../t .
/D0/CRAIG/MODULE-BUILD/blib/lib /D0/CRAIG/MODULE-BUILD/blib/arch t/lib
t/bundled lib ../..
/lib ../../t . ../../lib ../../t perl_root:[lib.site_perl.VMS_IA64]
perl_root:[lib.site_perl] perl_root:[lib.VMS_IA64.5_11_2] perl_r
oot:[lib] .) at (eval 11) line 2.

#   Failed test 'require '-::inc::latest::private_pm';'
#   at [.t]00-compile.t line 15.
#     Tried to require ''-::inc::latest::private_pm''.
#     Error:  Can't locate -::inc::latest::private_pm in @INC (@INC
contains: /D0/CRAIG/MODULE-BUILD/blib/lib /D0/CRAIG/MODULE-BUILD
/blib/arch t/lib t/bundled lib ../../lib ../../t .
/D0/CRAIG/MODULE-BUILD/blib/lib /D0/CRAIG/MODULE-BUILD/blib/arch t/lib
t/bundled
lib ../../lib ../../t . ../../lib ../../t
perl_root:[lib.site_perl.VMS_IA64] perl_root:[lib.site_perl]
perl_root:[lib.VMS_IA64.5_11_
2] perl_root:[lib] .) at (eval 12) line 2.

#   Failed test 'require '-::module::build_pm';'
#   at [.t]00-compile.t line 15.
#     Tried to require ''-::module::build_pm''.
#     Error:  Can't locate -::module::build_pm in @INC (@INC contains:
/D0/CRAIG/MODULE-BUILD/blib/lib /D0/CRAIG/MODULE-BUILD/blib/a
rch t/lib t/bundled lib ../../lib ../../t .
/D0/CRAIG/MODULE-BUILD/blib/lib /D0/CRAIG/MODULE-BUILD/blib/arch t/lib
t/bundled lib ../
../lib ../../t . ../../lib ../../t perl_root:[lib.site_perl.VMS_IA64]
perl_root:[lib.site_perl] perl_root:[lib.VMS_IA64.5_11_2] perl
_root:[lib] .) at (eval 13) line 2.

#   Failed test 'require '-::module::build::base_pm';'
#   at [.t]00-compile.t line 15.
#     Tried to require ''-::module::build::base_pm''.
#     Error:  Can't locate -::module::build::base_pm in @INC (@INC
contains: /D0/CRAIG/MODULE-BUILD/blib/lib /D0/CRAIG/MODULE-BUILD/
blib/arch t/lib t/bundled lib ../../lib ../../t .
/D0/CRAIG/MODULE-BUILD/blib/lib /D0/CRAIG/MODULE-BUILD/blib/arch t/lib
t/bundled l
ib ../../lib ../../t . ../../lib ../../t
perl_root:[lib.site_perl.VMS_IA64] perl_root:[lib.site_perl]
perl_root:[lib.VMS_IA64.5_11_2
] perl_root:[lib] .) at (eval 14) line 2.

#   Failed test 'require '-::module::build::compat_pm';'
#   at [.t]00-compile.t line 15.
#     Tried to require ''-::module::build::compat_pm''.
#     Error:  Can't locate -::module::build::compat_pm in @INC (@INC
contains: /D0/CRAIG/MODULE-BUILD/blib/lib /D0/CRAIG/MODULE-BUIL
D/blib/arch t/lib t/bundled lib ../../lib ../../t .
/D0/CRAIG/MODULE-BUILD/blib/lib /D0/CRAIG/MODULE-BUILD/blib/arch t/lib
t/bundled
 lib ../../lib ../../t . ../../lib ../../t
perl_root:[lib.site_perl.VMS_IA64] perl_root:[lib.site_perl]
perl_root:[lib.VMS_IA64.5_11
_2] perl_root:[lib] .) at (eval 15) line 2.

#   Failed test 'require '-::module::build::config_pm';'
#   at [.t]00-compile.t line 15.
#     Tried to require ''-::module::build::config_pm''.
#     Error:  Can't locate -::module::build::config_pm in @INC (@INC
contains: /D0/CRAIG/MODULE-BUILD/blib/lib /D0/CRAIG/MODULE-BUIL
D/blib/arch t/lib t/bundled lib ../../lib ../../t .
/D0/CRAIG/MODULE-BUILD/blib/lib /D0/CRAIG/MODULE-BUILD/blib/arch t/lib
t/bundled
 lib ../../lib ../../t . ../../lib ../../t
perl_root:[lib.site_perl.VMS_IA64] perl_root:[lib.site_perl]
perl_root:[lib.VMS_IA64.5_11
_2] perl_root:[lib] .) at (eval 16) line 2.

#   Failed test 'require '-::module::build::cookbook_pm';'
#   at [.t]00-compile.t line 15.
#     Tried to require ''-::module::build::cookbook_pm''.
#     Error:  Can't locate -::module::build::cookbook_pm in @INC (@INC
contains: /D0/CRAIG/MODULE-BUILD/blib/lib /D0/CRAIG/MODULE-BU
ILD/blib/arch t/lib t/bundled lib ../../lib ../../t .
/D0/CRAIG/MODULE-BUILD/blib/lib /D0/CRAIG/MODULE-BUILD/blib/arch t/lib
t/bundl
ed lib ../../lib ../../t . ../../lib ../../t
perl_root:[lib.site_perl.VMS_IA64] perl_root:[lib.site_perl]
perl_root:[lib.VMS_IA64.5_
11_2] perl_root:[lib] .) at (eval 17) line 2.

#   Failed test 'require '-::module::build::dumper_pm';'
#   at [.t]00-compile.t line 15.
#     Tried to require ''-::module::build::dumper_pm''.
#     Error:  Can't locate -::module::build::dumper_pm in @INC (@INC
contains: /D0/CRAIG/MODULE-BUILD/blib/lib /D0/CRAIG/MODULE-BUIL
D/blib/arch t/lib t/bundled lib ../../lib ../../t .
/D0/CRAIG/MODULE-BUILD/blib/lib /D0/CRAIG/MODULE-BUILD/blib/arch t/lib
t/bundled
 lib ../../lib ../../t . ../../lib ../../t
perl_root:[lib.site_perl.VMS_IA64] perl_root:[lib.site_perl]
perl_root:[lib.VMS_IA64.5_11
_2] perl_root:[lib] .) at (eval 18) line 2.

#   Failed test 'require '-::module::build::moduleinfo_pm';'
#   at [.t]00-compile.t line 15.
#     Tried to require ''-::module::build::moduleinfo_pm''.
#     Error:  Can't locate -::module::build::moduleinfo_pm in @INC
(@INC contains: /D0/CRAIG/MODULE-BUILD/blib/lib /D0/CRAIG/MODULE-
BUILD/blib/arch t/lib t/bundled lib ../../lib ../../t .
/D0/CRAIG/MODULE-BUILD/blib/lib /D0/CRAIG/MODULE-BUILD/blib/arch t/lib
t/bun
dled lib ../../lib ../../t . ../../lib ../../t
perl_root:[lib.site_perl.VMS_IA64] perl_root:[lib.site_perl]
perl_root:[lib.VMS_IA64.
5_11_2] perl_root:[lib] .) at (eval 19) line 2.

#   Failed test 'require '-::module::build::notes_pm';'
#   at [.t]00-compile.t line 15.
#     Tried to require ''-::module::build::notes_pm''.
#     Error:  Can't locate -::module::build::notes_pm in @INC (@INC
contains: /D0/CRAIG/MODULE-BUILD/blib/lib /D0/CRAIG/MODULE-BUILD
/blib/arch t/lib t/bundled lib ../../lib ../../t .
/D0/CRAIG/MODULE-BUILD/blib/lib /D0/CRAIG/MODULE-BUILD/blib/arch t/lib
t/bundled
lib ../../lib ../../t . ../../lib ../../t
perl_root:[lib.site_perl.VMS_IA64] perl_root:[lib.site_perl]
perl_root:[lib.VMS_IA64.5_11_
2] perl_root:[lib] .) at (eval 20) line 2.

#   Failed test 'require '-::module::build::platform::aix_pm';'
#   at [.t]00-compile.t line 15.
#     Tried to require ''-::module::build::platform::aix_pm''.
#     Error:  Can't locate -::module::build::platform::aix_pm in @INC
(@INC contains: /D0/CRAIG/MODULE-BUILD/blib/lib /D0/CRAIG/MODU
LE-BUILD/blib/arch t/lib t/bundled lib ../../lib ../../t .
/D0/CRAIG/MODULE-BUILD/blib/lib /D0/CRAIG/MODULE-BUILD/blib/arch t/lib
t/
bundled lib ../../lib ../../t . ../../lib ../../t
perl_root:[lib.site_perl.VMS_IA64] perl_root:[lib.site_perl]
perl_root:[lib.VMS_IA
64.5_11_2] perl_root:[lib] .) at (eval 21) line 2.

#   Failed test 'require '-::module::build::platform::amiga_pm';'
#   at [.t]00-compile.t line 15.
#     Tried to require ''-::module::build::platform::amiga_pm''.
#     Error:  Can't locate -::module::build::platform::amiga_pm in
@INC (@INC contains: /D0/CRAIG/MODULE-BUILD/blib/lib /D0/CRAIG/MO
DULE-BUILD/blib/arch t/lib t/bundled lib ../../lib ../../t .
/D0/CRAIG/MODULE-BUILD/blib/lib /D0/CRAIG/MODULE-BUILD/blib/arch t/lib
t/bundled lib ../../lib ../../t . ../../lib ../../t
perl_root:[lib.site_perl.VMS_IA64] perl_root:[lib.site_perl]
perl_root:[lib.VMS_
IA64.5_11_2] perl_root:[lib] .) at (eval 22) line 2.

#   Failed test 'require '-::module::build::platform::cygwin_pm';'
#   at [.t]00-compile.t line 15.
#     Tried to require ''-::module::build::platform::cygwin_pm''.
#     Error:  Can't locate -::module::build::platform::cygwin_pm in
@INC (@INC contains: /D0/CRAIG/MODULE-BUILD/blib/lib /D0/CRAIG/M
ODULE-BUILD/blib/arch t/lib t/bundled lib ../../lib ../../t .
/D0/CRAIG/MODULE-BUILD/blib/lib /D0/CRAIG/MODULE-BUILD/blib/arch t/lib
 t/bundled lib ../../lib ../../t . ../../lib ../../t
perl_root:[lib.site_perl.VMS_IA64] perl_root:[lib.site_perl]
perl_root:[lib.VMS
_IA64.5_11_2] perl_root:[lib] .) at (eval 23) line 2.

#   Failed test 'require '-::module::build::platform::darwin_pm';'
#   at [.t]00-compile.t line 15.
#     Tried to require ''-::module::build::platform::darwin_pm''.
#     Error:  Can't locate -::module::build::platform::darwin_pm in
@INC (@INC contains: /D0/CRAIG/MODULE-BUILD/blib/lib /D0/CRAIG/M
ODULE-BUILD/blib/arch t/lib t/bundled lib ../../lib ../../t .
/D0/CRAIG/MODULE-BUILD/blib/lib /D0/CRAIG/MODULE-BUILD/blib/arch t/lib
 t/bundled lib ../../lib ../../t . ../../lib ../../t
perl_root:[lib.site_perl.VMS_IA64] perl_root:[lib.site_perl]
perl_root:[lib.VMS
_IA64.5_11_2] perl_root:[lib] .) at (eval 24) line 2.

#   Failed test 'require '-::module::build::platform::default_pm';'
#   at [.t]00-compile.t line 15.
#     Tried to require ''-::module::build::platform::default_pm''.
#     Error:  Can't locate -::module::build::platform::default_pm in
@INC (@INC contains: /D0/CRAIG/MODULE-BUILD/blib/lib /D0/CRAIG/
MODULE-BUILD/blib/arch t/lib t/bundled lib ../../lib ../../t .
/D0/CRAIG/MODULE-BUILD/blib/lib /D0/CRAIG/MODULE-BUILD/blib/arch t/li
b t/bundled lib ../../lib ../../t . ../../lib ../../t
perl_root:[lib.site_perl.VMS_IA64] perl_root:[lib.site_perl]
perl_root:[lib.VM
S_IA64.5_11_2] perl_root:[lib] .) at (eval 25) line 2.

#   Failed test 'require '-::module::build::platform::ebcdic_pm';'
#   at [.t]00-compile.t line 15.
#     Tried to require ''-::module::build::platform::ebcdic_pm''.
#     Error:  Can't locate -::module::build::platform::ebcdic_pm in
@INC (@INC contains: /D0/CRAIG/MODULE-BUILD/blib/lib /D0/CRAIG/M
ODULE-BUILD/blib/arch t/lib t/bundled lib ../../lib ../../t .
/D0/CRAIG/MODULE-BUILD/blib/lib /D0/CRAIG/MODULE-BUILD/blib/arch t/lib
 t/bundled lib ../../lib ../../t . ../../lib ../../t
perl_root:[lib.site_perl.VMS_IA64] perl_root:[lib.site_perl]
perl_root:[lib.VMS
_IA64.5_11_2] perl_root:[lib] .) at (eval 26) line 2.

#   Failed test 'require '-::module::build::platform::macos_pm';'
#   at [.t]00-compile.t line 15.
#     Tried to require ''-::module::build::platform::macos_pm''.
#     Error:  Can't locate -::module::build::platform::macos_pm in
@INC (@INC contains: /D0/CRAIG/MODULE-BUILD/blib/lib /D0/CRAIG/MO
DULE-BUILD/blib/arch t/lib t/bundled lib ../../lib ../../t .
/D0/CRAIG/MODULE-BUILD/blib/lib /D0/CRAIG/MODULE-BUILD/blib/arch t/lib
t/bundled lib ../../lib ../../t . ../../lib ../../t
perl_root:[lib.site_perl.VMS_IA64] perl_root:[lib.site_perl]
perl_root:[lib.VMS_
IA64.5_11_2] perl_root:[lib] .) at (eval 27) line 2.

#   Failed test 'require '-::module::build::platform::mpeix_pm';'
#   at [.t]00-compile.t line 15.
#     Tried to require ''-::module::build::platform::mpeix_pm''.
#     Error:  Can't locate -::module::build::platform::mpeix_pm in
@INC (@INC contains: /D0/CRAIG/MODULE-BUILD/blib/lib /D0/CRAIG/MO
DULE-BUILD/blib/arch t/lib t/bundled lib ../../lib ../../t .
/D0/CRAIG/MODULE-BUILD/blib/lib /D0/CRAIG/MODULE-BUILD/blib/arch t/lib
t/bundled lib ../../lib ../../t . ../../lib ../../t
perl_root:[lib.site_perl.VMS_IA64] perl_root:[lib.site_perl]
perl_root:[lib.VMS_
IA64.5_11_2] perl_root:[lib] .) at (eval 28) line 2.

#   Failed test 'require '-::module::build::platform::os2_pm';'
#   at [.t]00-compile.t line 15.
#     Tried to require ''-::module::build::platform::os2_pm''.
#     Error:  Can't locate -::module::build::platform::os2_pm in @INC
(@INC contains: /D0/CRAIG/MODULE-BUILD/blib/lib /D0/CRAIG/MODU
LE-BUILD/blib/arch t/lib t/bundled lib ../../lib ../../t .
/D0/CRAIG/MODULE-BUILD/blib/lib /D0/CRAIG/MODULE-BUILD/blib/arch t/lib
t/
bundled lib ../../lib ../../t . ../../lib ../../t
perl_root:[lib.site_perl.VMS_IA64] perl_root:[lib.site_perl]
perl_root:[lib.VMS_IA
64.5_11_2] perl_root:[lib] .) at (eval 29) line 2.

#   Failed test 'require '-::module::build::platform::riscos_pm';'
#   at [.t]00-compile.t line 15.
#     Tried to require ''-::module::build::platform::riscos_pm''.
#     Error:  Can't locate -::module::build::platform::riscos_pm in
@INC (@INC contains: /D0/CRAIG/MODULE-BUILD/blib/lib /D0/CRAIG/M
ODULE-BUILD/blib/arch t/lib t/bundled lib ../../lib ../../t .
/D0/CRAIG/MODULE-BUILD/blib/lib /D0/CRAIG/MODULE-BUILD/blib/arch t/lib
 t/bundled lib ../../lib ../../t . ../../lib ../../t
perl_root:[lib.site_perl.VMS_IA64] perl_root:[lib.site_perl]
perl_root:[lib.VMS
_IA64.5_11_2] perl_root:[lib] .) at (eval 30) line 2.

#   Failed test 'require '-::module::build::platform::unix_pm';'
#   at [.t]00-compile.t line 15.
#     Tried to require ''-::module::build::platform::unix_pm''.
#     Error:  Can't locate -::module::build::platform::unix_pm in @INC
(@INC contains: /D0/CRAIG/MODULE-BUILD/blib/lib /D0/CRAIG/MOD
ULE-BUILD/blib/arch t/lib t/bundled lib ../../lib ../../t .
/D0/CRAIG/MODULE-BUILD/blib/lib /D0/CRAIG/MODULE-BUILD/blib/arch t/lib
t
/bundled lib ../../lib ../../t . ../../lib ../../t
perl_root:[lib.site_perl.VMS_IA64] perl_root:[lib.site_perl]
perl_root:[lib.VMS_I
A64.5_11_2] perl_root:[lib] .) at (eval 31) line 2.

#   Failed test 'require '-::module::build::platform::vms_pm';'
#   at [.t]00-compile.t line 15.
#     Tried to require ''-::module::build::platform::vms_pm''.
#     Error:  Can't locate -::module::build::platform::vms_pm in @INC
(@INC contains: /D0/CRAIG/MODULE-BUILD/blib/lib /D0/CRAIG/MODU
LE-BUILD/blib/arch t/lib t/bundled lib ../../lib ../../t .
/D0/CRAIG/MODULE-BUILD/blib/lib /D0/CRAIG/MODULE-BUILD/blib/arch t/lib
t/
bundled lib ../../lib ../../t . ../../lib ../../t
perl_root:[lib.site_perl.VMS_IA64] perl_root:[lib.site_perl]
perl_root:[lib.VMS_IA
64.5_11_2] perl_root:[lib] .) at (eval 32) line 2.

#   Failed test 'require '-::module::build::platform::vos_pm';'
#   at [.t]00-compile.t line 15.
#     Tried to require ''-::module::build::platform::vos_pm''.
#     Error:  Can't locate -::module::build::platform::vos_pm in @INC
(@INC contains: /D0/CRAIG/MODULE-BUILD/blib/lib /D0/CRAIG/MODU
LE-BUILD/blib/arch t/lib t/bundled lib ../../lib ../../t .
/D0/CRAIG/MODULE-BUILD/blib/lib /D0/CRAIG/MODULE-BUILD/blib/arch t/lib
t/
bundled lib ../../lib ../../t . ../../lib ../../t
perl_root:[lib.site_perl.VMS_IA64] perl_root:[lib.site_perl]
perl_root:[lib.VMS_IA
64.5_11_2] perl_root:[lib] .) at (eval 33) line 2.

#   Failed test 'require '-::module::build::platform::windows_pm';'
#   at [.t]00-compile.t line 15.
#     Tried to require ''-::module::build::platform::windows_pm''.
#     Error:  Can't locate -::module::build::platform::windows_pm in
@INC (@INC contains: /D0/CRAIG/MODULE-BUILD/blib/lib /D0/CRAIG/
MODULE-BUILD/blib/arch t/lib t/bundled lib ../../lib ../../t .
/D0/CRAIG/MODULE-BUILD/blib/lib /D0/CRAIG/MODULE-BUILD/blib/arch t/li
b t/bundled lib ../../lib ../../t . ../../lib ../../t
perl_root:[lib.site_perl.VMS_IA64] perl_root:[lib.site_perl]
perl_root:[lib.VM
S_IA64.5_11_2] perl_root:[lib] .) at (eval 34) line 2.

#   Failed test 'require '-::module::build::podparser_pm';'
#   at [.t]00-compile.t line 15.
#     Tried to require ''-::module::build::podparser_pm''.
#     Error:  Can't locate -::module::build::podparser_pm in @INC
(@INC contains: /D0/CRAIG/MODULE-BUILD/blib/lib /D0/CRAIG/MODULE-B
UILD/blib/arch t/lib t/bundled lib ../../lib ../../t .
/D0/CRAIG/MODULE-BUILD/blib/lib /D0/CRAIG/MODULE-BUILD/blib/arch t/lib
t/bund
led lib ../../lib ../../t . ../../lib ../../t
perl_root:[lib.site_perl.VMS_IA64] perl_root:[lib.site_perl]
perl_root:[lib.VMS_IA64.5
_11_2] perl_root:[lib] .) at (eval 35) line 2.

#   Failed test 'require '-::module::build::ppmmaker_pm';'
#   at [.t]00-compile.t line 15.
#     Tried to require ''-::module::build::ppmmaker_pm''.
#     Error:  Can't locate -::module::build::ppmmaker_pm in @INC (@INC
contains: /D0/CRAIG/MODULE-BUILD/blib/lib /D0/CRAIG/MODULE-BU
ILD/blib/arch t/lib t/bundled lib ../../lib ../../t .
/D0/CRAIG/MODULE-BUILD/blib/lib /D0/CRAIG/MODULE-BUILD/blib/arch t/lib
t/bundl
ed lib ../../lib ../../t . ../../lib ../../t
perl_root:[lib.site_perl.VMS_IA64] perl_root:[lib.site_perl]
perl_root:[lib.VMS_IA64.5_
11_2] perl_root:[lib] .) at (eval 36) line 2.

#   Failed test 'require '-::module::build::version_pm';'
#   at [.t]00-compile.t line 15.
#     Tried to require ''-::module::build::version_pm''.
#     Error:  Can't locate -::module::build::version_pm in @INC (@INC
contains: /D0/CRAIG/MODULE-BUILD/blib/lib /D0/CRAIG/MODULE-BUI
LD/blib/arch t/lib t/bundled lib ../../lib ../../t .
/D0/CRAIG/MODULE-BUILD/blib/lib /D0/CRAIG/MODULE-BUILD/blib/arch t/lib
t/bundle
d lib ../../lib ../../t . ../../lib ../../t
perl_root:[lib.site_perl.VMS_IA64] perl_root:[lib.site_perl]
perl_root:[lib.VMS_IA64.5_1
1_2] perl_root:[lib] .) at (eval 37) line 2.

#   Failed test 'require '-::module::build::yaml_pm';'
#   at [.t]00-compile.t line 15.
#     Tried to require ''-::module::build::yaml_pm''.
#     Error:  Can't locate -::module::build::yaml_pm in @INC (@INC
contains: /D0/CRAIG/MODULE-BUILD/blib/lib /D0/CRAIG/MODULE-BUILD/
blib/arch t/lib t/bundled lib ../../lib ../../t .
/D0/CRAIG/MODULE-BUILD/blib/lib /D0/CRAIG/MODULE-BUILD/blib/arch t/lib
t/bundled l
ib ../../lib ../../t . ../../lib ../../t
perl_root:[lib.site_perl.VMS_IA64] perl_root:[lib.site_perl]
perl_root:[lib.VMS_IA64.5_11_2
] perl_root:[lib] .) at (eval 38) line 2.
# Looks like you failed 28 tests of 28.
%SYSTEM-F-ABORT, abort
[.t]00-compile.t .................
Dubious, test returned 4 (wstat 1024, 0x400)
Failed 28/28 subtests

Can't call method "eliminate_macros" on unblessed reference at
/perl_root/lib/File/Spec/VMS.pm line 1052.
Compilation failed in require at Build.com line 52.
BEGIN failed--compilation aborted at Build.com line 52.
%SYSTEM-F-NOLOGNAM, no logical name match

#   Failed test 'relative cpan_client resolved relative to $^X'
#   at [.t.actions]installdeps.t line 37.
#                   '%SYSTEM-F-NOLOGNAM, no logical name match
# '
#     doesn't match '(?i-xsm:dsa0\:\[craig\.blead\]ndbgperl\.exe\;3)'

#   Failed test 'saw File::Spec prereq'
#   at [.t.actions]installdeps.t line 38.
#                   '%SYSTEM-F-NOLOGNAM, no logical name match
# '
#     doesn't match '(?-xism:File::Spec)'

#   Failed test 'saw Getopt::Long prereq'
#   at [.t.actions]installdeps.t line 39.
#                   '%SYSTEM-F-NOLOGNAM, no logical name match
# '
#     doesn't match '(?-xism:Getopt::Long)'

#   Failed test 'Build installdeps with bad cpan_client dies'
#   at [.t.actions]installdeps.t line 44.
#                   '%SYSTEM-F-NOLOGNAM, no logical name match
# Can't call method "eliminate_macros" on unblessed reference at
/perl_root/lib/File/Spec/VMS.pm line 1052.
# Compilation failed in require at Build.com line 52.
# BEGIN failed--compilation aborted at Build.com line 52.
# %SYSTEM-F-NOLOGNAM, no logical name match
# '
#     doesn't match '(?-xism:cpan_client .* is not executable)'
# Looks like you failed 4 tests of 7.
%SYSTEM-F-ABORT, abort
[.t.actions]installdeps.t ........
Dubious, test returned 4 (wstat 1024, 0x400)
Failed 4/7 subtests

[.t]add_property.t ............... ok
No 'module_name' was provided and it could not be inferred
from other properties.  This will prevent a packlist from
being written for this file.  Please set either 'module_name'
or 'dist_version_from' in Build.PL.

#   Failed test at [.t]basic.t line 30.
# Looks like you failed 1 test of 58.
%SYSTEM-F-ABORT, abort
[.t]basic.t ......................
Dubious, test returned 4 (wstat 1024, 0x400)
Failed 1/58 subtests

[.t]bundle_inc.t ................. skipped: bundle_inc tests will
never succeed in PERL_CORE

#   Failed test 'make ran without error'
#   at [.t]compat.t line 364.

#   Failed test 'PL_files generated - foo'
#   at [.t]compat.t line 367.

#   Failed test 'make test ran without error'
#   at [.t]compat.t line 374.

#   Failed test 'make test output indicated success'
#   at [.t]compat.t line 375.
#                   'MCR DSA0:[CRAIG.BLEAD]NDBGPERL.EXE;3 BUILD.COM
--MAKEFILE_ENV_MACROS 1 TEST
# CAN'T CALL METHOD "ELIMINATE_MACROS" ON UNBLESSED REFERENCE AT
/PERL_ROOT/LIB/FILE/SPEC/VMS.PM LINE 1052.
# COMPILATION FAILED IN REQUIRE AT BUILD.COM LINE 54.
# BEGIN FAILED--COMPILATION ABORTED AT BUILD.COM LINE 54.
# %SYSTEM-F-NOLOGNAM, NO LOGICAL NAME MATCH
# %MMK-F-ERRUPD, ERROR STATUS %X000001BC OCCURRED WHEN UPDATING TARGET TEST
# %MMK-F-ERRUPD, ERROR STATUS %X000001BC OCCURRED WHEN UPDATING TARGET TEST
# '
#     doesn't match '(?-xism:DONE\.|SUCCESS)'

#   Failed test 'make realclean ran without error'
#   at [.t]compat.t line 380.

#   Failed test 'Descrip.MMS cleaned up with realclean'
#   at [.t]compat.t line 414.

#   Failed test 'Descrip.MMS cleaned up with distclean'
#   at [.t]compat.t line 414.

#   Failed test 'make ran without error'
#   at [.t]compat.t line 364.

#   Failed test 'PL_files generated - foo'
#   at [.t]compat.t line 367.

#   Failed test 'make test ran without error'
#   at [.t]compat.t line 374.

#   Failed test 'make test output indicated success'
#   at [.t]compat.t line 375.
#                   'MCR DSA0:[CRAIG.BLEAD]NDBGPERL.EXE;3 BUILD.COM
--MAKEFILE_ENV_MACROS 1 TEST
# CAN'T CALL METHOD "ELIMINATE_MACROS" ON UNBLESSED REFERENCE AT
/PERL_ROOT/LIB/FILE/SPEC/VMS.PM LINE 1052.
# COMPILATION FAILED IN REQUIRE AT BUILD.COM LINE 54.
# BEGIN FAILED--COMPILATION ABORTED AT BUILD.COM LINE 54.
# %SYSTEM-F-NOLOGNAM, NO LOGICAL NAME MATCH
# %MMK-F-ERRUPD, ERROR STATUS %X000001BC OCCURRED WHEN UPDATING TARGET TEST
# %MMK-F-ERRUPD, ERROR STATUS %X000001BC OCCURRED WHEN UPDATING TARGET TEST
# '
#     doesn't match '(?-xism:DONE\.|SUCCESS)'

#   Failed test 'make realclean ran without error'
#   at [.t]compat.t line 380.

#   Failed test 'Descrip.MMS cleaned up with realclean'
#   at [.t]compat.t line 414.

#   Failed test 'Descrip.MMS cleaned up with distclean'
#   at [.t]compat.t line 414.

#   Failed test 'Saw destination directory for INSTALLDIRS=vendor'
#   at [.t]compat.t line 260.
#                   '# %SYSTEM-F-ABORT, abort
# # MCR dsa0:[craig.blead]ndbgperl.exe;3 Build.COM
--makefile_env_macros 1 fakeinstall
# # !!!!!!!!!!!!!!!!!!!!!!!!!!!!!!!!!!!!!!!!!!!!!!!!!!!!!!!!!!!!!!!!!!!!!!!!
# # WARNING: Can't create 'perl_root:[man.man3]'
# # Unknown Error
# # !!!!!!!!!!!!!!!!!!!!!!!!!!!!!!!!!!!!!!!!!!!!!!!!!!!!!!!!!!!!!!!!!!!!!!!!
# # Building Simple
# # Manifying [.blib.lib]simple.pm -> [.blib.libdoc]simple.rno
# # Installing D0:[CRAIG.MODULE-BUILD.MB-4N0TVjMo.libdir]simple.pm
# # Installing perl_root:[man.man3]simple.rno
# # Writing D0:[CRAIG.MODULE-BUILD.MB-4N0TVjMo.libdir.VMS_IA64-ithread.auto.Simple].packlist
# '
#     doesn't match
'(?ix-sm:D0\:\[CRAIG\.MODULE\-BUILD\.MB\-4N0TVjMo\.lbiidr\] .*
Simple\.pm)'

#   Failed test 'Saw destination directory for PREFIX=$libdir2'
#   at [.t]compat.t line 260.
#                   '# %SYSTEM-F-ABORT, abort
# # MCR dsa0:[craig.blead]ndbgperl.exe;3 Build.COM
--makefile_env_macros 1 fakeinstall
# # !!!!!!!!!!!!!!!!!!!!!!!!!!!!!!!!!!!!!!!!!!!!!!!!!!!!!!!!!!!!!!!!!!!!!!!!
# # WARNING: Can't create 'perl_root:[man.man3]'
# # Unknown Error
# # !!!!!!!!!!!!!!!!!!!!!!!!!!!!!!!!!!!!!!!!!!!!!!!!!!!!!!!!!!!!!!!!!!!!!!!!
# # Building Simple
# # Installing D0:[CRAIG.MODULE-BUILD.MB-4N0TVjMo.libdir]simple.pm
# # Installing perl_root:[man.man3]simple.rno
# # Writing D0:[CRAIG.MODULE-BUILD.MB-4N0TVjMo.libdir.VMS_IA64-ithread.auto.Simple].packlist
# '
#     doesn't match
'(?ix-sm:D0\:\[CRAIG\.MODULE\-BUILD\.MB\-4N0TVjMo\.lbiidr\] .*
Simple\.pm)'

#   Failed test 'Saw destination directory for PREFIX=$libdir2 LIB=mylib'
#   at [.t]compat.t line 260.
#                   '# %SYSTEM-F-ABORT, abort
# # MCR dsa0:[craig.blead]ndbgperl.exe;3 Build.COM
--makefile_env_macros 1 fakeinstall
# # !!!!!!!!!!!!!!!!!!!!!!!!!!!!!!!!!!!!!!!!!!!!!!!!!!!!!!!!!!!!!!!!!!!!!!!!
# # WARNING: Can't create 'perl_root:[man.man3]'
# # Unknown Error
# # !!!!!!!!!!!!!!!!!!!!!!!!!!!!!!!!!!!!!!!!!!!!!!!!!!!!!!!!!!!!!!!!!!!!!!!!
# # Building Simple
# # Installing D0:[CRAIG.MODULE-BUILD.MB-4N0TVjMo.libdir]simple.pm
# # Installing perl_root:[man.man3]simple.rno
# # Writing D0:[CRAIG.MODULE-BUILD.MB-4N0TVjMo.libdir.VMS_IA64-ithread.auto.Simple].packlist
# '
#     doesn't match
'(?ix-sm:D0\:\[CRAIG\.MODULE\-BUILD\.MB\-4N0TVjMo\.lbiidr\][/\\]mylib[/\\]Simple\.pm)'
# Looks like you failed 17 tests of 156.
%SYSTEM-F-ABORT, abort
[.t]compat.t .....................
Dubious, test returned 4 (wstat 1024, 0x400)
Failed 17/156 subtests

[.t.compat]exit.t ................ ok
[.t]debug.t ...................... ok
[.t]destinations.t ............... ok
[.t]ext.t ........................ ok
[.t]extend.t ..................... ok
[.t]files.t ...................... ok
[.t]help.t ....................... ok
WARNING: Can't figure out install path for types: libhtml
Files will not be installed.
[.t]install.t .................... ok

#   Failed test 'installed etc/config'
#   at [.t]install_extra_target.t line 131.

#   Failed test 'installed shared/data'
#   at [.t]install_extra_target.t line 132.

#   Failed test 'installed shared/html'
#   at [.t]install_extra_target.t line 133.
# OUTPUT:
# Building Simple
# Installing D0:[CRAIG.MODULE-BUILD.MB-hiMifh1b.t.install_extra_targets-43664.etc.simple]config.
# Installing D0:[CRAIG.MODULE-BUILD.MB-hiMifh1b.t.install_extra_targets-43664.lib.perl5]simple.pm
# Installing D0:[CRAIG.MODULE-BUILD.MB-hiMifh1b.t.install_extra_targets-43664.man.man3]simple.rno
# Installing D0:[CRAIG.MODULE-BUILD.MB-hiMifh1b.t.install_extra_targets-43664.shared.simple]data.
# Installing D0:[CRAIG.MODULE-BUILD.MB-hiMifh1b.t.install_extra_targets-43664.shared.simple.html]index.html
# Looks like you failed 3 tests of 6.
%SYSTEM-F-ABORT, abort
[.t]install_extra_target.t .......
Dubious, test returned 4 (wstat 1024, 0x400)
Failed 3/6 subtests

[.t]manifypods.t ................. ok
[.t]metadata.t ................... ok
[.t]metadata2.t .................. ok
[.t]moduleinfo.t ................. ok
Can't call method "eliminate_macros" on unblessed reference at
/perl_root/lib/File/Spec/VMS.pm line 1052.
Compilation failed in require at Build.com line 52.
BEGIN failed--compilation aborted at Build.com line 52.
%SYSTEM-F-NOLOGNAM, no logical name match

#   Failed test 'Ran Build distmeta to create META.yml'
#   at [.t]mymeta.t line 51.
#                   '%SYSTEM-F-NOLOGNAM, no logical name match
# '
#     doesn't match '(?-xism:Creating META.yml)'
Can't use an undefined value as an ARRAY reference at [.t]mymeta.t line 53.
# Looks like you planned 24 tests but ran 5.
# Looks like you failed 1 test of 5 run.
# Looks like your test exited with 1 just after 5.
%SYSTEM-F-ABORT, abort
[.t]mymeta.t .....................
Dubious, test returned 4 (wstat 1024, 0x400)
Failed 20/24 subtests

[.t]new_from_context.t ........... ok
[.t]notes.t ...................... ok
[.t]par.t ........................ skipped: PAR::Dist 0.17 or up not
installed to check .par's.
[.t]parents.t .................... ok
[.t]perl_mb_opt.t ................ ok
WARNING: the following files are missing in your kit:
        lib/bar.pm_pl
Please inform the author.

[.t]pl_files.t ................... ok
[.t]pod_parser.t ................. ok
[.t]ppm.t ........................ skipped: Needs porting work on VMS
No 'module_name' was provided and it could not be inferred
from other properties.  This will prevent a packlist from
being written for this file.  Please set either 'module_name'
or 'dist_version_from' in Build.PL.
ERROR: Missing required field 'dist_author' for metafile
ERROR: Missing required field 'dist_abstract' for metafile

#   Failed test 'module_name guessed from directory name'
#   at [.t.properties]module_name.t line 27.
#          got: undef
#     expected: 'Not::So::Simple'
# Looks like you failed 1 test of 4.
%SYSTEM-F-ABORT, abort
[.t.properties]module_name.t .....
Dubious, test returned 4 (wstat 1024, 0x400)
Failed 1/4 subtests

[.t.properties]needs_compiler.t .. ok

#   Failed test 'share_dir filemap for copying to lib complete'
#   at [.t.properties]share_dir.t line 162.
#     Structures begin differing at:
#          $got->{[.share]foo.txt} = '[.dist.foo_txt]'
#     $expected->{[.share]foo.txt} = '[.dist.Simple-Share]foo.txt'

#   Failed test 'share_dir files copied to blib'
#   at [.t.properties]share_dir.t line 181.
#     Structures begin differing at:
#          $got->[0] = 'blib/lib/auto/share/dist/foo_txt/foo.txt'
#     $expected->[0] = 'blib/lib/auto/share/dist/Simple-Share/foo.txt'

#   Failed test 'share_dir files correctly installed'
#   at [.t.properties]share_dir.t line 204.
#     Structures begin differing at:
#          $got->[0] = 'temp_install/lib/perl5/auto/share/dist/foo_txt/foo.txt'
#     $expected->[0] =
'temp_install/lib/perl5/auto/share/dist/Simple-Share/foo.txt'
# Looks like you failed 3 tests of 21.
%SYSTEM-F-ABORT, abort
[.t.properties]share_dir.t .......
Dubious, test returned 4 (wstat 1024, 0x400)
Failed 3/21 subtests

        (less 2 skipped subtests: 16 okay)
[.t]resume.t ..................... ok
[.t]runthrough.t ................. ok
[.t]sample.t ..................... ok
[.t]script_dist.t ................ ok
[.t]signature.t .................. skipped: $ENV{TEST_SIGNATURE} is not set
[.t]test_file_exts.t ............. ok
[.t]test_type.t .................. skipped: (no reason given)
[.t]test_types.t ................. ok
[.t]tilde.t ...................... ok
[.t]use_tap_harness.t ............ ok
[.t]versions.t ................... ok
[.t]write_default_maniskip.t ..... ok
[.t]xs.t ......................... skipped: Child test output confuses harness

Test Summary Report
-------------------
[.t]00-compile.t               (Wstat: 1024 Tests: 28 Failed: 28)
  Failed tests:
1-28
  Non-zero exit status: 4
[.t.actions]installdeps.t      (Wstat: 1024 Tests: 7 Failed: 4)
  Failed tests:
4-7
  Non-zero exit status: 4
[.t]basic.t                    (Wstat: 1024 Tests: 58 Failed: 1)
  Failed test:
6
  Non-zero exit status: 4
[.t]compat.t                   (Wstat: 1024 Tests: 156 Failed: 17)
  Failed tests:
64-68, 71, 74, 83-87, 90, 93, 142, 144
                146
  Non-zero exit status: 4
[.t]install_extra_target.t     (Wstat: 1024 Tests: 6 Failed: 3)
  Failed tests:
4-6
  Non-zero exit status: 4
[.t]mymeta.t                   (Wstat: 1024 Tests: 5 Failed: 1)
  Failed test:
5
  Non-zero exit status: 4
  Parse errors: Bad plan.  You planned 24 tests but ran 5.
[.t.properties]module_name.t   (Wstat: 1024 Tests: 4 Failed: 1)
  Failed test:
2
  Non-zero exit status: 4
[.t.properties]share_dir.t     (Wstat: 1024 Tests: 21 Failed: 3)
  Failed tests:
14, 17, 19
  Non-zero exit status: 4
Files=44, Tests=1104, 1048 wallclock secs ( 2.19 usr +  0.00 sys =  2.19 CPU)
Result: FAIL
Failed 8/44 test programs. 58/1104 subtests failed.
%SYSTEM-F-NOLOGNAM, no logical name match
%MMK-F-ERRUPD, error status %X000001BC occurred when updating target TEST



nntp.perl.org: Perl Programming lists via nntp and http.
Comments to Ask Bjørn Hansen at ask@perl.org | Group listing | About