develooper Front page | perl.perl5.porters | Postings from December 2009

Smoke [5.11.2] v5.11.2-117-g8b19c1f FAIL(Xm) netbsd 5.0.1 (i386/1 cpu)

From:
Steven Schubiger
Date:
December 6, 2009 19:01
Subject:
Smoke [5.11.2] v5.11.2-117-g8b19c1f FAIL(Xm) netbsd 5.0.1 (i386/1 cpu)
Message ID:
4b1c700a.0637560a.2b08.5227@mx.google.com
Automated smoke report for 5.11.2 patch 8b19c1f8f171b4db09e0f4369f5fa72b488e66bd v5.11.2-117-g8b19c1f
p5netbsd: Intel 686-class (i386/1 cpu)
    on        netbsd - 5.0.1
    using     cc version 4.1.3 20080704 prerelease (NetBSD nb2 20081120)
    smoketime 4 hours 4 minutes (average 30 minutes 35 seconds)

Summary: FAIL(Xm)

O = OK  F = Failure(s), extended report at the bottom
X = Failure(s) under TEST but not under harness
? = still running or test results not (yet) available
Build failures during:       - = unknown or N/A
c = Configure, m = make, M = make (after miniperl), t = make test-prep

v5.11.2-117-g8b19c1f  Configuration (common) none
----------- ---------------------------------------------------------
O O O O     
O O X O     -Duse64bitint
m - m -     -Duseithreads
m - m -     -Duseithreads -Duse64bitint
| | | +----- PERLIO = perlio -DDEBUGGING
| | +------- PERLIO = stdio  -DDEBUGGING
| +--------- PERLIO = perlio
+----------- PERLIO = stdio


Locally applied patches:
    SMOKE8b19c1f8f171b4db09e0f4369f5fa72b488e66bd

Failures: (common-args) none
[stdio] -DDEBUGGING -Duse64bitint
Inconsistent test results (between TEST and harness):
    ../lib/Benchmark.t......................FAILED at test 126

Compiler messages(gcc):
perlio.c: In function 'PerlIOStdio_set_ptrcnt':
perlio.c:3437: warning: pointer targets in assignment differ in signedness
/usr/include/sys/cdefs_elf.h:67:20: error: missing binary operator before token "("
<command line>:1:1: warning: "TIME_HIRES_STAT" redefined
<command line>:1:1: warning: this is the location of the previous definition
APItest.xs: In function 'XS_XS__APItest_pmflag':
APItest.xs:930: warning: 'Perl_pmflag' is deprecated (declared at ../../proto.h:2550)
sv.c:9171: error: expected declaration specifiers or '...' before ')' token
sv.c: In function 'Perl_sv_vcatpvfn':
sv.c:9545: error: too few arguments to function 'S_vcatpvfn_missing_argument'
sv.c:9548: error: too few arguments to function 'S_vcatpvfn_missing_argument'
sv.c:9696: error: too few arguments to function 'S_vcatpvfn_missing_argument'
sv.c:9699: error: too few arguments to function 'S_vcatpvfn_missing_argument'

-- 
Report by Test::Smoke v1.40 build 1242 running on perl 5.10.0
(Reporter v0.035 / Smoker v0.044)



nntp.perl.org: Perl Programming lists via nntp and http.
Comments to Ask Bjørn Hansen at ask@perl.org | Group listing | About