develooper Front page | perl.perl5.porters | Postings from September 2009

Smoke [5.11.0] blead-2417-ge00e4ce FAIL(F) MSWin32 WinXP/.Net SP3 (x86/2 cpu)

From:
Steve Hay
Date:
September 25, 2009 21:57
Subject:
Smoke [5.11.0] blead-2417-ge00e4ce FAIL(F) MSWin32 WinXP/.Net SP3 (x86/2 cpu)
Message ID:
UKMAIL02pH71yEXUIEA000000f6@ukmail02.planit.group
Automated smoke report for 5.11.0 patch e00e4ce90e17ff7101c36fc5496e8b2e353e7f7b blead-2417-ge00e4ce
maldoror.bath.planit.group: Intel(R) Core(TM)2 CPU 6700 @ 2.66GHz(~2660 MHz) (x86/2 cpu)
    on        MSWin32 - WinXP/.Net SP3
    using     cl version 15.00.30729.01
    smoketime 6 hours 8 minutes (average 36 minutes 53 seconds)

Summary: FAIL(F)

O = OK  F = Failure(s), extended report at the bottom
X = Failure(s) under TEST but not under harness
? = still running or test results not (yet) available
Build failures during:       - = unknown or N/A
c = Configure, m = make, M = make (after miniperl), t = make test-prep

blead-2417-ge00e4ce  Configuration (common) -DCCTYPE=MSVC90 -DINST_TOP=$(INST_DRV)\Smoke\doesntexist
----------- ---------------------------------------------------------
F F         -Duselargefiles
F F         -Duselargefiles -Dusemymalloc
F F         -Duselargefiles -Duseithreads -Uuseimpsys
F F         -Duselargefiles -Duseithreads -Uuseimpsys -Dusemymalloc
F F         -Duselargefiles -Duseithreads
| +--------- -DDEBUGGING
+----------- no debugging


Locally applied patches:
    SMOKEe00e4ce90e17ff7101c36fc5496e8b2e353e7f7b

Failures: (common-args) -DCCTYPE=MSVC90 -DINST_TOP=$(INST_DRV)\Smoke\doesntexist
[default] -Duselargefiles
[default] -DDEBUGGING -Duselargefiles
[default] -Duselargefiles -Dusemymalloc
[default] -DDEBUGGING -Duselargefiles -Dusemymalloc
[default] -Duselargefiles -Duseithreads -Uuseimpsys
[default] -DDEBUGGING -Duselargefiles -Duseithreads -Uuseimpsys
[default] -Duselargefiles -Duseithreads -Uuseimpsys -Dusemymalloc
[default] -DDEBUGGING -Duselargefiles -Duseithreads -Uuseimpsys -Dusemymalloc
[default] -DDEBUGGING -Duselargefiles -Duseithreads
../t/pod/diag.t.............................................FAILED
    667

[default] -Duselargefiles -Duseithreads
../ext/IO/t/io_sock.t.......................................FAILED
    25
    Bad plan.  You planned 26 tests but ran 25.
../t/pod/diag.t.............................................FAILED
    667

Compiler messages(MSWin32):
..\perl.c(4023) : warning C4101: 'len' : unreferenced local variable
Cwd.xs(77) : warning C4101: 'symlink' : unreferenced local variable
ListUtil.xs(197) : warning C4101: 'magic' : unreferenced local variable

-- 
Report by Test::Smoke v1.39 build 1235 running on perl 5.11.0
(Reporter v0.035 / Smoker v0.044)




nntp.perl.org: Perl Programming lists via nntp and http.
Comments to Ask Bjørn Hansen at ask@perl.org | Group listing | About