develooper Front page | perl.perl5.porters | Postings from August 2009

Smoke [5.11.0] blead-1972-g7f96267 FAIL(F) MSWin32 WinXP/.Net SP3 (x86/2 cpu)

From:
Steve Hay
Date:
August 29, 2009 20:21
Subject:
Smoke [5.11.0] blead-1972-g7f96267 FAIL(F) MSWin32 WinXP/.Net SP3 (x86/2 cpu)
Message ID:
UKMAIL024gVvpQN1Rmp0000182e@ukmail02.planit.group
Automated smoke report for 5.11.0 patch 7f96267964ee5927ec664b88d0dc0ab724d45540 blead-1972-g7f96267
maldoror.bath.planit.group: Intel(R) Core(TM)2 CPU 6700 @ 2.66GHz(~2660 MHz) (x86/2 cpu)
    on        MSWin32 - WinXP/.Net SP3
    using     bcc32 version 5.5.1
    smoketime 4 hours 30 minutes (average 27 minutes 4 seconds)

Summary: FAIL(F)

O = OK  F = Failure(s), extended report at the bottom
X = Failure(s) under TEST but not under harness
? = still running or test results not (yet) available
Build failures during:       - = unknown or N/A
c = Configure, m = make, M = make (after miniperl), t = make test-prep

blead-1972-g7f96267  Configuration (common) -DCCTYPE=BORLAND -DINST_TOP=$(INST_DRV)\Smoke\doesntexist
----------- ---------------------------------------------------------
F F         -Duselargefiles
F F         -Duselargefiles -Dusemymalloc
F F         -Duselargefiles -Duseithreads -Uuseimpsys
F F         -Duselargefiles -Duseithreads -Uuseimpsys -Dusemymalloc
F F         -Duselargefiles -Duseithreads
| +--------- -DDEBUGGING
+----------- no debugging


Locally applied patches:
    SMOKE7f96267964ee5927ec664b88d0dc0ab724d45540

Failures: (common-args) -DCCTYPE=BORLAND -DINST_TOP=$(INST_DRV)\Smoke\doesntexist
[default] -Duselargefiles
[default] -DDEBUGGING -Duselargefiles
[default] -Duselargefiles -Dusemymalloc
[default] -DDEBUGGING -Duselargefiles -Dusemymalloc
[default] -Duselargefiles -Duseithreads -Uuseimpsys
[default] -DDEBUGGING -Duselargefiles -Duseithreads -Uuseimpsys
[default] -Duselargefiles -Duseithreads
[default] -DDEBUGGING -Duselargefiles -Duseithreads
../t/io/errno.t.............................................FAILED
    1-16
../t/op/reg_60508.t.........................................FAILED
../lib/maintainers.t........................................FAILED
    50, 74, 677, 702, 706, 1076, 1117, 1194
    1349, 1398, 1485, 1611, 2275, 2319, 2481
    2539, 2542, 2548, 3225-3226, 3255, 4478
    4484, 4825-4830
../lib/strict.t.............................................FAILED
    77

[default] -Duselargefiles -Duseithreads -Uuseimpsys -Dusemymalloc
[default] -DDEBUGGING -Duselargefiles -Duseithreads -Uuseimpsys -Dusemymalloc
../t/io/errno.t.............................................FAILED
    1-16
../t/op/reg_60508.t.........................................FAILED
../t/op/threads.t...........................................FAILED
    Bad plan.  You planned 14 tests but ran 9.
../lib/maintainers.t........................................FAILED
    50, 74, 677, 702, 706, 1076, 1117, 1194
    1349, 1398, 1485, 1611, 2275, 2319, 2481
    2539, 2542, 2548, 3225-3226, 3255, 4478
    4484, 4825-4830
../lib/strict.t.............................................FAILED
    77

Compiler messages(bcc32):
Warning W8004 blocksort.c 901: 'numQSorted' is assigned a value that is never used in function mainSort
Warning W8004 compress.c 225: 'zPend' is assigned a value that is never used in function generateMTFValues
Warning W8004 compress.c 598: 'nBytes' is assigned a value that is never used in function sendMTFValues
Warning W8008 decompress.c 588: Condition is always true in function BZ2_decompress
Warning W8008 decompress.c 591: Condition is always true in function BZ2_decompress
Warning W8008 bzlib.c 93: Condition is always false in function bz_config_ok
Warning W8066 bzlib.c 93: Unreachable code in function bz_config_ok
Warning W8008 bzlib.c 94: Condition is always false in function bz_config_ok
Warning W8066 bzlib.c 94: Unreachable code in function bz_config_ok
Warning W8008 bzlib.c 95: Condition is always false in function bz_config_ok
Warning W8066 bzlib.c 95: Unreachable code in function bz_config_ok
Warning W8057 bzlib.c 111: Parameter 'opaque' is never used in function default_bzalloc
Warning W8057 bzlib.c 117: Parameter 'opaque' is never used in function default_bzfree
Warning W8004 bzlib.c 454: 'progress' is assigned a value that is never used in function BZ2_bzCompress
Warning W8066 bzlib.c 866: Unreachable code in function BZ2_bzDecompress
Warning W8008 bzlib.c 866: Condition is always true in function BZ2_bzDecompress
Warning W8008 crc32.c 232: Condition is always true in function crc32
Warning W8066 crc32.c 242: Unreachable code in function crc32
Warning W8004 deflate.c 351: 'hash_head' is assigned a value that is never used in function deflateSetDictionary
Warning W8008 deflate.c 1278: Condition is always false in function fill_window
Warning W8066 deflate.c 1279: Unreachable code in function fill_window
Warning W8004 deflate.c 1669: 'bflush' is assigned a value that is never used in function deflate_slow

-- 
Report by Test::Smoke v1.39 build 1235 running on perl 5.11.0
(Reporter v0.035 / Smoker v0.044)




nntp.perl.org: Perl Programming lists via nntp and http.
Comments to Ask Bjørn Hansen at ask@perl.org | Group listing | About