develooper Front page | perl.perl5.porters | Postings from August 2009

Smoke [5.11.0] blead-1971-gba4c7dd FAIL(F) MSWin32 Win2000 SP4 (x86/1 cpu)

From:
George Greer
Date:
August 29, 2009 18:07
Subject:
Smoke [5.11.0] blead-1971-gba4c7dd FAIL(F) MSWin32 Win2000 SP4 (x86/1 cpu)
Message ID:
200908300107.n7U17HGm027025@m-l.org
Automated smoke report for 5.11.0 patch ba4c7dd4891fdf4ba3a68fea2323a208aa627586 blead-1971-gba4c7dd
perl-win2k: Intel(R) Core(TM) i7 CPU 920 @ 2.67GHz(~2565 MHz) (x86/1 cpu)
    on        MSWin32 - Win2000 SP4
    using     cl version 14.00.50727.42
    smoketime 3 hours 16 minutes (average 24 minutes 32 seconds)

Summary: FAIL(F)

O = OK  F = Failure(s), extended report at the bottom
X = Failure(s) under TEST but not under harness
? = still running or test results not (yet) available
Build failures during:       - = unknown or N/A
c = Configure, m = make, M = make (after miniperl), t = make test-prep

blead-1971-gba4c7dd  Configuration (common) none
----------- ---------------------------------------------------------
F F         
F F         -Duselargefiles
F F         -Duseithreads
F F         -Duseithreads -Duselargefiles
| +--------- -DDEBUGGING
+----------- no debugging


Locally applied patches:
    SMOKEba4c7dd4891fdf4ba3a68fea2323a208aa627586

Failures: (common-args) none
[default] 
[default] -DDEBUGGING
../t/op/reg_60508.t.........................................FAILED
../lib/maintainers.t........................................FAILED
    52, 76, 687, 712, 716, 1085, 1127, 1205
    1365, 1414, 1499, 1625, 2287, 2330, 2495
    2554, 2557, 2563, 3251-3252, 3281
../ext/B/t/concise.t........................................FAILED
    2-5, 148-157
../ext/B/t/lint.t...........................................FAILED
    1-29
../ext/B/t/o.t..............................................FAILED
    2-5, 7-9
../ext/B/t/optree_check.t...................................FAILED
    11-13
../ext/B/t/optree_concise.t.................................FAILED
    12-14, 16
../ext/B/t/optree_constants.t...............................FAILED
    27-28
../ext/B/t/optree_misc.t....................................FAILED
    2
../ext/B/t/optree_samples.t.................................FAILED
    11, 20
../ext/B/t/optree_sort.t....................................FAILED
    3, 5, 7, 9
../ext/B/t/optree_specials.t................................FAILED
    2-8
../ext/B/t/optree_varinit.t.................................FAILED
    6-8, 13-15, 19-22
../ext/B/t/showlex.t........................................FAILED
    2-3, 9-10
../ext/Devel-DProf/t/DProf.t................................FAILED
    Bad plan.  You planned 20 tests but ran 0.
../ext/Devel-PPPort/t/ppphtest.t............................FAILED
    2-10, 12-15, 18-23, 27, 29-30, 32-40, 42-45
    47-50, 55, 57-61, 63-64, 66-68, 70-71, 73-75
    80-81, 83-85, 87, 89-94, 96, 98, 100-113
    115-129, 131, 134, 136-138, 142-144, 147
    149-158, 160-162, 164-182, 184-189, 191-209
    211-214, 216-223, 225-226, 228-230, 232-234
../ext/IO-Compress/t/010examples-bzip2.t....................FAILED
    2-4, 6-8, 10-12, 14-15, 17-19
../ext/IO-Compress/t/010examples-zlib.t.....................FAILED
    2-4, 6-8, 10-12, 14-15, 17-19
../ext/IO-Compress/t/cz-05examples.t........................FAILED
    2-4, 6-8, 10-12, 14-15, 17-19, 21-22, 24-26
../ext/Test-Harness/t/perl5lib.t............................FAILED
    1
../ext/Test-Harness/t/process.t.............................FAILED
    1-27
../ext/re/t/lexical_debug.t.................................FAILED
    1, 3, 5, 7-10
../ext/re/t/regop.t.........................................FAILED
    1, 3-19
    Bad plan.  You planned 54 tests but ran 19.
../lib/strict.t.............................................FAILED
    77

[default] -Duselargefiles
[default] -DDEBUGGING -Duselargefiles
../t/op/alarm.t.............................................FAILED
    4
../t/op/reg_60508.t.........................................FAILED
../lib/maintainers.t........................................FAILED
    52, 76, 687, 712, 716, 1085, 1127, 1205
    1365, 1414, 1499, 1625, 2287, 2330, 2495
    2554, 2557, 2563, 3251-3252, 3281
../ext/B/t/concise.t........................................FAILED
    2-5, 148-157
../ext/B/t/lint.t...........................................FAILED
    1-29
../ext/B/t/o.t..............................................FAILED
    2-5, 7-9
../ext/B/t/optree_check.t...................................FAILED
    11-13
../ext/B/t/optree_concise.t.................................FAILED
    12-14, 16
../ext/B/t/optree_constants.t...............................FAILED
    27-28
../ext/B/t/optree_misc.t....................................FAILED
    2
../ext/B/t/optree_samples.t.................................FAILED
    11, 20
../ext/B/t/optree_sort.t....................................FAILED
    3, 5, 7, 9
../ext/B/t/optree_specials.t................................FAILED
    2-8
../ext/B/t/optree_varinit.t.................................FAILED
    6-8, 13-15, 19-22
../ext/B/t/showlex.t........................................FAILED
    2-3, 9-10
../ext/Devel-DProf/t/DProf.t................................FAILED
    Bad plan.  You planned 20 tests but ran 0.
../ext/Devel-PPPort/t/ppphtest.t............................FAILED
    2-10, 12-15, 18-23, 27, 29-30, 32-40, 42-45
    47-50, 55, 57-61, 63-64, 66-68, 70-71, 73-75
    80-81, 83-85, 87, 89-94, 96, 98, 100-113
    115-129, 131, 134, 136-138, 142-144, 147
    149-158, 160-162, 164-182, 184-189, 191-209
    211-214, 216-223, 225-226, 228-230, 232-234
../ext/IO-Compress/t/010examples-bzip2.t....................FAILED
    2-4, 6-8, 10-12, 14-15, 17-19
../ext/IO-Compress/t/010examples-zlib.t.....................FAILED
    2-4, 6-8, 10-12, 14-15, 17-19
../ext/IO-Compress/t/cz-05examples.t........................FAILED
    2-4, 6-8, 10-12, 14-15, 17-19, 21-22, 24-26
../ext/Test-Harness/t/perl5lib.t............................FAILED
    1
../ext/Test-Harness/t/process.t.............................FAILED
    1-27
../ext/re/t/lexical_debug.t.................................FAILED
    1, 3, 5, 7-10
../ext/re/t/regop.t.........................................FAILED
    1, 3-19
    Bad plan.  You planned 54 tests but ran 19.
../lib/strict.t.............................................FAILED
    77

[default] -Duseithreads
../t/op/reg_60508.t.........................................FAILED
../lib/maintainers.t........................................FAILED
    52, 76, 687, 712, 716, 1085, 1127, 1205
    1365, 1414, 1499, 1625, 2287, 2330, 2495
    2554, 2557, 2563, 3251-3252, 3281
../ext/B/t/concise.t........................................FAILED
    2-5, 148-157
../ext/B/t/lint.t...........................................FAILED
    1-29
../ext/B/t/o.t..............................................FAILED
    2-5, 7-9
../ext/B/t/optree_check.t...................................FAILED
    11-13
../ext/B/t/optree_concise.t.................................FAILED
    12-14, 16
../ext/B/t/optree_constants.t...............................FAILED
    27-28
../ext/B/t/optree_misc.t....................................FAILED
    2
../ext/B/t/optree_samples.t.................................FAILED
    11, 20
../ext/B/t/optree_sort.t....................................FAILED
    3, 5, 7, 9
../ext/B/t/optree_specials.t................................FAILED
    2-8
../ext/B/t/optree_varinit.t.................................FAILED
    6-8, 13-15, 19-22
../ext/B/t/showlex.t........................................FAILED
    2-3, 9-10
../ext/Devel-DProf/t/DProf.t................................FAILED
    Bad plan.  You planned 20 tests but ran 0.
../ext/Devel-PPPort/t/ppphtest.t............................FAILED
    2-10, 12-15, 18-23, 27, 29-30, 32-40, 42-45
    47-50, 55, 57-61, 63-64, 66-68, 70-71, 73-75
    80-81, 83-85, 87, 89-94, 96, 98, 100-113
    115-129, 131, 134, 136-138, 142-144, 147
    149-158, 160-162, 164-182, 184-189, 191-209
    211-214, 216-223, 225-226, 228-230, 232-234
../ext/IO-Compress/t/010examples-bzip2.t....................FAILED
    2-4, 6-8, 10-12, 14-15, 17-19
../ext/IO-Compress/t/010examples-zlib.t.....................FAILED
    2-4, 6-8, 10-12, 14-15, 17-19
../ext/IO-Compress/t/cz-05examples.t........................FAILED
    2-4, 6-8, 10-12, 14-15, 17-19, 21-22, 24-26
../ext/IO/t/io_sock.t.......................................FAILED
    Bad plan.  You planned 26 tests but ran 4.
../ext/Test-Harness/t/perl5lib.t............................FAILED
    1
../ext/Test-Harness/t/process.t.............................FAILED
    1-27
../ext/re/t/lexical_debug.t.................................FAILED
    1, 3, 5, 7-10
../ext/re/t/regop.t.........................................FAILED
    1, 3-19
    Bad plan.  You planned 54 tests but ran 19.
../ext/threads/t/exit.t.....................................FAILED
    4, 11-16
../ext/threads/t/thread.t...................................FAILED
    26-29
../lib/strict.t.............................................FAILED
    77

[default] -DDEBUGGING -Duseithreads
[default] -Duseithreads -Duselargefiles
../t/op/reg_60508.t.........................................FAILED
../lib/maintainers.t........................................FAILED
    52, 76, 687, 712, 716, 1085, 1127, 1205
    1365, 1414, 1499, 1625, 2287, 2330, 2495
    2554, 2557, 2563, 3251-3252, 3281
../ext/B/t/concise.t........................................FAILED
    2-5, 148-157
../ext/B/t/lint.t...........................................FAILED
    1-29
../ext/B/t/o.t..............................................FAILED
    2-5, 7-9
../ext/B/t/optree_check.t...................................FAILED
    11-13
../ext/B/t/optree_concise.t.................................FAILED
    12-14, 16
../ext/B/t/optree_constants.t...............................FAILED
    27-28
../ext/B/t/optree_misc.t....................................FAILED
    2
../ext/B/t/optree_samples.t.................................FAILED
    11, 20
../ext/B/t/optree_sort.t....................................FAILED
    3, 5, 7, 9
../ext/B/t/optree_specials.t................................FAILED
    2-8
../ext/B/t/optree_varinit.t.................................FAILED
    6-8, 13-15, 19-22
../ext/B/t/showlex.t........................................FAILED
    2-3, 9-10
../ext/Devel-DProf/t/DProf.t................................FAILED
    Bad plan.  You planned 20 tests but ran 0.
../ext/Devel-PPPort/t/ppphtest.t............................FAILED
    2-10, 12-15, 18-23, 27, 29-30, 32-40, 42-45
    47-50, 55, 57-61, 63-64, 66-68, 70-71, 73-75
    80-81, 83-85, 87, 89-94, 96, 98, 100-113
    115-129, 131, 134, 136-138, 142-144, 147
    149-158, 160-162, 164-182, 184-189, 191-209
    211-214, 216-223, 225-226, 228-230, 232-234
../ext/IO-Compress/t/010examples-bzip2.t....................FAILED
    2-4, 6-8, 10-12, 14-15, 17-19
../ext/IO-Compress/t/010examples-zlib.t.....................FAILED
    2-4, 6-8, 10-12, 14-15, 17-19
../ext/IO-Compress/t/cz-05examples.t........................FAILED
    2-4, 6-8, 10-12, 14-15, 17-19, 21-22, 24-26
../ext/Test-Harness/t/perl5lib.t............................FAILED
    1
../ext/Test-Harness/t/process.t.............................FAILED
    1-27
../ext/re/t/lexical_debug.t.................................FAILED
    1, 3, 5, 7-10
../ext/re/t/regop.t.........................................FAILED
    1, 3-19
    Bad plan.  You planned 54 tests but ran 19.
../ext/threads/t/exit.t.....................................FAILED
    4, 11-16
../ext/threads/t/thread.t...................................FAILED
    26-29
../lib/strict.t.............................................FAILED
    77

[default] -DDEBUGGING -Duseithreads -Duselargefiles
../t/op/alarm.t.............................................FAILED
    2
../t/op/reg_60508.t.........................................FAILED
../lib/maintainers.t........................................FAILED
    52, 76, 687, 712, 716, 1085, 1127, 1205
    1365, 1414, 1499, 1625, 2287, 2330, 2495
    2554, 2557, 2563, 3251-3252, 3281
../ext/B/t/concise.t........................................FAILED
    2-5, 148-157
../ext/B/t/lint.t...........................................FAILED
    1-29
../ext/B/t/o.t..............................................FAILED
    2-5, 7-9
../ext/B/t/optree_check.t...................................FAILED
    11-13
../ext/B/t/optree_concise.t.................................FAILED
    12-14, 16
../ext/B/t/optree_constants.t...............................FAILED
    27-28
../ext/B/t/optree_misc.t....................................FAILED
    2
../ext/B/t/optree_samples.t.................................FAILED
    11, 20
../ext/B/t/optree_sort.t....................................FAILED
    3, 5, 7, 9
../ext/B/t/optree_specials.t................................FAILED
    2-8
../ext/B/t/optree_varinit.t.................................FAILED
    6-8, 13-15, 19-22
../ext/B/t/showlex.t........................................FAILED
    2-3, 9-10
../ext/Devel-DProf/t/DProf.t................................FAILED
    Bad plan.  You planned 20 tests but ran 0.
../ext/Devel-PPPort/t/ppphtest.t............................FAILED
    2-10, 12-15, 18-23, 27, 29-30, 32-40, 42-45
    47-50, 55, 57-61, 63-64, 66-68, 70-71, 73-75
    80-81, 83-85, 87, 89-94, 96, 98, 100-113
    115-129, 131, 134, 136-138, 142-144, 147
    149-158, 160-162, 164-182, 184-189, 191-209
    211-214, 216-223, 225-226, 228-230, 232-234
../ext/IO-Compress/t/010examples-bzip2.t....................FAILED
    2-4, 6-8, 10-12, 14-15, 17-19
../ext/IO-Compress/t/010examples-zlib.t.....................FAILED
    2-4, 6-8, 10-12, 14-15, 17-19
../ext/IO-Compress/t/cz-05examples.t........................FAILED
    2-4, 6-8, 10-12, 14-15, 17-19, 21-22, 24-26
../ext/Test-Harness/t/perl5lib.t............................FAILED
    1
../ext/Test-Harness/t/process.t.............................FAILED
    1-27
../ext/re/t/lexical_debug.t.................................FAILED
    1, 3, 5, 7-10
../ext/re/t/regop.t.........................................FAILED
    1, 3-19
    Bad plan.  You planned 54 tests but ran 19.
../ext/threads/t/exit.t.....................................FAILED
    4, 11-16
../ext/threads/t/thread.t...................................FAILED
    26-29
../lib/strict.t.............................................FAILED
    77

Compiler messages(MSWin32):
Cwd.xs(77) : warning C4101: 'symlink' : unreferenced local variable
ListUtil.xs(197) : warning C4101: 'magic' : unreferenced local variable

-- 
Report by Test::Smoke v1.39 build 1235 running on perl 5.10.0
(Reporter v0.035 / Smoker v0.044)




nntp.perl.org: Perl Programming lists via nntp and http.
Comments to Ask Bjørn Hansen at ask@perl.org | Group listing | About