develooper Front page | perl.perl5.porters | Postings from August 2009

Smoke [5.11.0] blead-1969-ga2c4b2d FAIL(F) openbsd 4.5 (i386/1 cpu)

From:
Steven Schubiger
Date:
August 29, 2009 03:15
Subject:
Smoke [5.11.0] blead-1969-ga2c4b2d FAIL(F) openbsd 4.5 (i386/1 cpu)
Message ID:
4a98ff95.0707d00a.1c2c.6f07@mx.google.com
Automated smoke report for 5.11.0 patch a2c4b2d6db383103b96e4733616b17d0a3bb0bd9 blead-1969-ga2c4b2d
p5openbsd: AMD Athlon(tm) Processor ("AuthenticAMD" 686-class, 256KB L2 cache) (909 MHz) (i386/1 cpu)
    on        openbsd - 4.5
    using     cc version 3.3.5 (propolice)
    smoketime 12 hours 1 minute (average 1 hour 30 minutes)

Summary: FAIL(F)

O = OK  F = Failure(s), extended report at the bottom
X = Failure(s) under TEST but not under harness
? = still running or test results not (yet) available
Build failures during:       - = unknown or N/A
c = Configure, m = make, M = make (after miniperl), t = make test-prep

blead-1969-ga2c4b2d  Configuration (common) none
----------- ---------------------------------------------------------
F F F F     
F F F F     -Duse64bitint
F F F F     -Duseithreads
F F F F     -Duseithreads -Duse64bitint
| | | +----- PERLIO = perlio -DDEBUGGING
| | +------- PERLIO = stdio  -DDEBUGGING
| +--------- PERLIO = perlio
+----------- PERLIO = stdio


Locally applied patches:
    SMOKEa2c4b2d6db383103b96e4733616b17d0a3bb0bd9

Failures: (common-args) none
[stdio/perlio] 
[stdio/perlio] -DDEBUGGING
[stdio] -Duse64bitint
[stdio/perlio] -DDEBUGGING -Duse64bitint
[stdio/perlio] -Duseithreads
[stdio/perlio] -DDEBUGGING -Duseithreads
[stdio/perlio] -DDEBUGGING -Duseithreads -Duse64bitint
    ../lib/File/Copy.t..........................................FAILED
        Bad plan.  You planned 461 tests but ran 82.

[perlio] -Duse64bitint
    ../lib/File/Copy.t..........................................FAILED
        Bad plan.  You planned 461 tests but ran 82.
Inconsistent test results (between TEST and harness):
    ../t/op/rand.t..........................FAILED at test 5

[stdio] -Duseithreads -Duse64bitint
    ../lib/File/Copy.t..........................................FAILED
        Bad plan.  You planned 461 tests but ran 82.
Inconsistent test results (between TEST and harness):
    ../t/io/errno.t.........................FAILED at test 11

[perlio] -Duseithreads -Duse64bitint
    ../lib/File/Copy.t..........................................FAILED
        Bad plan.  You planned 461 tests but ran 82.
    ../t/io/errno.t.............................................FAILED
        13

Compiler messages(gcc):
Configure .../tmp//ccDiYgQk.o(.text+0x3e): In function `main':
/tmp//ccJOAJhL.o(.text+0x5d): In function `main':
/tmp//ccXdUCzK.o(.text+0x1c): In function `xxx':
/tmp//ccTsCBiY.o(.text+0xde): In function `main':
sv.o(.text+0x1d8b): In function `Perl_sv_2pv_flags':
libperl.a(DynaLoader.o)(.text+0x242): In function `XS_DynaLoader_dl_load_file':
libperl.a(sv.o)(.text+0x1d8b): In function `Perl_sv_2pv_flags':
<command line>:12:1: warning: "TIME_HIRES_STAT" redefined
<command line>:11:1: warning: this is the location of the previous definition
<command line>:13:1: warning: "TIME_HIRES_STAT" redefined
<command line>:12:1: warning: this is the location of the previous definition
util.o(.text+0x1b3): In function `savestr':
str.o(.text+0x5d): In function `str_2ptr':
../libperl.a(sv.o)(.text+0x1d8b): In function `Perl_sv_2pv_flags':
Configure .../tmp//ccwRirus.o(.text+0x3e): In function `main':
/home/sts/source/p5-current/UU/try.c:20: warning: sprintf() is often misused, please use snprintf()
/tmp//cclAyXiJ.o(.text+0x5d): In function `main':
/home/sts/source/p5-current/UU/try.c:29: warning: sprintf() is often misused, please use snprintf()
/tmp//ccodApZv.o(.text+0x1c): In function `xxx':
/home/sts/source/p5-current/UU/try.c:29: warning: vsprintf() is often misused, please use vsnprintf()
/tmp//ccuaJFId.o(.text+0xde): In function `main':
/home/sts/source/p5-current/UU/try.c:52: warning: sprintf() is often misused, please use snprintf()
sv.o(.text+0xb7ff): In function `Perl_sv_2pv_flags':
/home/sts/source/p5-current/sv.c:2774: warning: sprintf() is often misused, please use snprintf()
libperl.a(DynaLoader.o)(.text+0x556): In function `XS_DynaLoader_dl_load_file':
/home/sts/source/p5-current/ext/DynaLoader/DynaLoader.xs:171: warning: strcat() is almost always misused, please use strlcat()
libperl.a(sv.o)(.text+0xb7ff): In function `Perl_sv_2pv_flags':
<command line>:14:1: warning: "TIME_HIRES_STAT" redefined
<command line>:13:1: warning: this is the location of the previous definition
<command line>:15:1: warning: "TIME_HIRES_STAT" redefined
<command line>:14:1: warning: this is the location of the previous definition
util.o(.text+0x283): In function `savestr':
/home/sts/source/p5-current/x2p/util.c:147: warning: strcpy() is almost always misused, please use strlcpy()
str.o(.text+0x81): In function `str_2ptr':
/home/sts/source/p5-current/x2p/str.c:32: warning: sprintf() is often misused, please use snprintf()
../libperl.a(sv.o)(.text+0xb7ff): In function `Perl_sv_2pv_flags':
Configure .../tmp//ccQdjile.o(.text+0x3e): In function `main':
/tmp//ccSFWeFI.o(.text+0x5d): In function `main':
/tmp//ccBnFhBh.o(.text+0x1c): In function `xxx':
/tmp//ccMxiPQF.o(.text+0xde): In function `main':
sv.o(.text+0x224f): In function `Perl_sv_2pv_flags':
libperl.a(sv.o)(.text+0x224f): In function `Perl_sv_2pv_flags':
../libperl.a(sv.o)(.text+0x224f): In function `Perl_sv_2pv_flags':
Configure .../tmp//ccODMGPj.o(.text+0x3e): In function `main':
/tmp//ccsdKzUg.o(.text+0x5d): In function `main':
/tmp//ccBrMqPi.o(.text+0x1c): In function `xxx':
/tmp//ccxwnxrJ.o(.text+0xde): In function `main':
sv.o(.text+0xac26): In function `Perl_sv_2pv_flags':
libperl.a(DynaLoader.o)(.text+0x55a): In function `XS_DynaLoader_dl_load_file':
libperl.a(sv.o)(.text+0xac26): In function `Perl_sv_2pv_flags':
../libperl.a(sv.o)(.text+0xac26): In function `Perl_sv_2pv_flags':
Configure .../tmp//cczXFeTP.o(.text+0x3e): In function `main':
/tmp//ccluPabX.o(.text+0x5d): In function `main':
/tmp//ccwNEFvb.o(.text+0x1c): In function `xxx':
/tmp//ccLtbDUG.o(.text+0xde): In function `main':
sv.o(.text+0x1ee7): In function `Perl_sv_2pv_flags':
libperl.a(DynaLoader.o)(.text+0x4aa): In function `XS_DynaLoader_dl_load_file':
libperl.a(sv.o)(.text+0x1ee7): In function `Perl_sv_2pv_flags':
../libperl.a(sv.o)(.text+0x1ee7): In function `Perl_sv_2pv_flags':
Configure .../tmp//ccHGobRf.o(.text+0x3e): In function `main':
/tmp//ccdoajFC.o(.text+0x5d): In function `main':
/tmp//ccUKlOxU.o(.text+0x1c): In function `xxx':
/tmp//ccodWysc.o(.text+0xde): In function `main':
sv.o(.text+0xba3b): In function `Perl_sv_2pv_flags':
libperl.a(DynaLoader.o)(.text+0x8de): In function `XS_DynaLoader_dl_load_file':
libperl.a(sv.o)(.text+0xba3b): In function `Perl_sv_2pv_flags':
<command line>:16:1: warning: "TIME_HIRES_STAT" redefined
<command line>:15:1: warning: this is the location of the previous definition
../libperl.a(sv.o)(.text+0xba3b): In function `Perl_sv_2pv_flags':
Configure .../tmp//ccPWyRIN.o(.text+0x3e): In function `main':
/tmp//ccIpNmdc.o(.text+0x5d): In function `main':
/tmp//ccNZccBB.o(.text+0x1c): In function `xxx':
/tmp//ccljTTyL.o(.text+0xde): In function `main':
sv.o(.text+0x239b): In function `Perl_sv_2pv_flags':
libperl.a(sv.o)(.text+0x239b): In function `Perl_sv_2pv_flags':
../libperl.a(sv.o)(.text+0x239b): In function `Perl_sv_2pv_flags':
Configure .../tmp//cctYsdfF.o(.text+0x3e): In function `main':
/tmp//ccjosTSZ.o(.text+0x5d): In function `main':
/tmp//ccxlBQxa.o(.text+0x1c): In function `xxx':
/tmp//ccynoKgi.o(.text+0xde): In function `main':
sv.o(.text+0xaebe): In function `Perl_sv_2pv_flags':
libperl.a(sv.o)(.text+0xaebe): In function `Perl_sv_2pv_flags':
../libperl.a(sv.o)(.text+0xaebe): In function `Perl_sv_2pv_flags':

-- 
Report by Test::Smoke v1.40 build 1242 running on perl 5.10.0
(Reporter v0.035 / Smoker v0.044)



nntp.perl.org: Perl Programming lists via nntp and http.
Comments to Ask Bjørn Hansen at ask@perl.org | Group listing | About