develooper Front page | perl.perl5.porters | Postings from August 2009

Smoke [5.10.1] perl-5.10.1-RC1-48-g2284e3e FAIL(F) openvms V8.3-1H1(IA64/2 cpu)

From:
Craig A. Berry
Date:
August 16, 2009 23:42
Subject:
Smoke [5.10.1] perl-5.10.1-RC1-48-g2284e3e FAIL(F) openvms V8.3-1H1(IA64/2 cpu)
Message ID:
0KOI007W4DAJPP80@asmtp021.mac.com
Automated smoke report for 5.10.1 patch 2284e3ef028b60160f89ba1a877e6bdd3bc24a08 perl-5.10.1-RC1-48-g2284e3e
ALMA: HP rx2600  (1.50GHz/6.0MB) (IA64/2 cpu)
    on        openvms - V8.3-1H1
    using     ? CC/DECC version 70390018
    smoketime 3 hours 48 minutes (average 1 hour 54 minutes)

Summary: FAIL(F)

O = OK  F = Failure(s), extended report at the bottom
X = Failure(s) under TEST but not under harness
? = still running or test results not (yet) available
Build failures during:       - = unknown or N/A
c = Configure, m = make, M = make (after miniperl), t = make test-prep

perl-5.10.1-RC1-48-g2284e3e  Configuration (common) none
----------- ---------------------------------------------------------
F -         
F -         -Duseithreads
| +--------- -DDEBUGGING
+----------- no debugging


Locally applied patches:
    SMOKE2284e3ef028b60160f89ba1a877e6bdd3bc24a08

Failures: (common-args) none
[default] 
    lib/ExtUtils/t/Install........................................FAILED at test 15
    lib/Module/Build/t/debug......................................FAILED at test 3

[default] -Duseithreads
    lib/ExtUtils/t/Installapi2....................................FAILED at test 15
    lib/ExtUtils/t/Install........................................FAILED at test 15
    lib/Module/Build/t/debug......................................FAILED at test 3

-- 
Report by Test::Smoke v1.39 build 1235 running on perl 5.10.0
(Reporter v0.035 / Smoker v0.044)



nntp.perl.org: Perl Programming lists via nntp and http.
Comments to Ask Bjørn Hansen at ask@perl.org | Group listing | About