develooper Front page | perl.perl5.porters | Postings from August 2009

Smoke [5.10.1] perl-5.10.1-RC1-1-gbadf489 FAIL(F) netbsd 5.0.1 (i386/1 cpu)

From:
Steven Schubiger
Date:
August 6, 2009 20:13
Subject:
Smoke [5.10.1] perl-5.10.1-RC1-1-gbadf489 FAIL(F) netbsd 5.0.1 (i386/1 cpu)
Message ID:
4a7b9bd7.0a04d00a.07ea.6432@mx.google.com
Automated smoke report for 5.10.1 patch badf48949ef0f6be41c06a682330f4aa37c4f4ff perl-5.10.1-RC1-1-gbadf489
p5netbsd: Intel 686-class (i386/1 cpu)
    on        netbsd - 5.0.1
    using     cc version 4.1.3 20080704 prerelease (NetBSD nb2 20081120)
    smoketime 9 hours 14 minutes (average 1 hour 9 minutes)

Summary: FAIL(F)

O = OK  F = Failure(s), extended report at the bottom
X = Failure(s) under TEST but not under harness
? = still running or test results not (yet) available
Build failures during:       - = unknown or N/A
c = Configure, m = make, M = make (after miniperl), t = make test-prep

perl-5.10.1-RC1-1-gbadf489  Configuration (common) none
----------- ---------------------------------------------------------
O O O O     
O O O O     -Duse64bitint
O O F F     -Duseithreads
F F F F     -Duseithreads -Duse64bitint
| | | +----- PERLIO = perlio -DDEBUGGING
| | +------- PERLIO = stdio  -DDEBUGGING
| +--------- PERLIO = perlio
+----------- PERLIO = stdio


Locally applied patches:
    SMOKEbadf48949ef0f6be41c06a682330f4aa37c4f4ff

Failures: (common-args) none
[stdio] -DDEBUGGING -Duseithreads
    ../lib/CPANPLUS/t/04_CPANPLUS-Module.t......................FAILED
        109
    ../lib/Archive/Extract/t/01_Archive-Extract.t...............FAILED
        35, 37-42, 61-66, 107, 109-110, 112-114
        131, 133-138, 157-162, 191, 193-198, 217-222
        239, 241-246, 265-270, 287, 289-294, 313-318
        347, 349-354, 373-378, 395, 397-398, 400-402
        419, 421-426, 445-450, 467, 469-470, 472-474
        527, 529-534, 553-558
    ../lib/CPANPLUS/Dist/Build/t/02_CPANPLUS-Dist-Build.t.......FAILED
        11-16, 20, 23, 26-31, 37
    ../lib/IPC/Cmd/t/01_IPC-Cmd.t...............................FAILED
        17-18, 23-24, 26-29, 34-35, 37-40, 45-46
        48-51, 56-57, 59-62, 67-68, 70-73, 78-79
        81-84, 89-90, 92-95, 100-101, 103-106, 111-112
        114-117, 122-123, 125-128, 133-134, 136-139
        144-145, 147-150, 155-156, 158-161, 166-167
        169-172, 177-178, 180-183, 188-189, 191-194
        199-200, 202-205, 210-211, 213-216, 221-222
        224-227, 232-233
    ../t/io/dup.t...............................................FAILED
        15-16
    ../t/io/open.t..............................................FAILED
        93
    ../lib/CPANPLUS/t/20_CPANPLUS-Dist-MM.t.....................FAILED
        11-12, 14, 17-18, 41-43
    ../lib/CPANPLUS/t/19_CPANPLUS-Dist.t........................FAILED
        62-63, 68-70

[perlio] -DDEBUGGING -Duseithreads
    ../lib/CPANPLUS/t/04_CPANPLUS-Module.t......................FAILED
        109
    ../lib/CPANPLUS/Dist/Build/t/02_CPANPLUS-Dist-Build.t.......FAILED
        11-16, 20, 23, 26-31, 37
    ../lib/CPANPLUS/t/19_CPANPLUS-Dist.t........................FAILED
        31
    ../lib/Archive/Extract/t/01_Archive-Extract.t...............FAILED
        35, 37-42, 61-66, 107, 109-110, 112-114
        131, 133-138, 157-162, 191, 193-198, 217-222
        239, 241-246, 265-270, 287, 289-294, 313-318
        347, 349-354, 373-378, 395, 397-398, 400-402
        419, 421-426, 445-450, 467, 469-470, 472-474
        527, 529-534, 553-558
    ../t/io/dup.t...............................................FAILED
        15-16
    ../t/io/open.t..............................................FAILED
        93
    ../lib/CPANPLUS/t/20_CPANPLUS-Dist-MM.t.....................FAILED
        11-12, 14, 17-18, 42
    ../lib/IPC/Cmd/t/01_IPC-Cmd.t...............................FAILED
        17-18, 23-24, 26-29, 34-35, 37-40, 45-46
        48-51, 56-57, 59-62, 67-68, 70-73, 78-79
        81-84, 89-90, 92-95, 100-101, 103-106, 111-112
        114-117, 122-123, 125-128, 133-134, 136-139
        144-145, 147-150, 155-156, 158-161, 166-167
        169-172, 177-178, 180-183, 188-189, 191-194
        199-200, 202-205, 210-211, 213-216, 221-222
        224-227, 232-233

[stdio] -Duseithreads -Duse64bitint
    ../lib/CPANPLUS/t/04_CPANPLUS-Module.t......................FAILED
        109
    ../lib/CPANPLUS/Dist/Build/t/02_CPANPLUS-Dist-Build.t.......FAILED
        11-16, 20, 23, 26-31, 37
    ../lib/Archive/Extract/t/01_Archive-Extract.t...............FAILED
        35, 37-42, 61-66, 107, 109-110, 112-114
        131, 133-138, 157-162, 191, 193-198, 217-222
        239, 241-246, 265-270, 287, 289-294, 313-318
        347, 349-354, 373-378, 395, 397-398, 400-402
        419, 421-426, 445-450, 467, 469-470, 472-474
        527, 529-534, 553-558
    ../lib/IPC/Cmd/t/01_IPC-Cmd.t...............................FAILED
        17-18, 23-24, 26-29, 34-35, 37-40, 45-46
        48-51, 56-57, 59-62, 67-68, 70-73, 78-79
        81-84, 89-90, 92-95, 100-101, 103-106, 111-112
        114-117, 122-123, 125-128, 133-134, 136-139
        144-145, 147-150, 155-156, 158-161, 166-167
        169-172, 177-178, 180-183, 188-189, 191-194
        199-200, 202-205, 210-211, 213-216, 221-222
        224-227, 232-233
    ../t/io/dup.t...............................................FAILED
        15-16
    ../t/io/open.t..............................................FAILED
        93
    ../lib/CPANPLUS/t/20_CPANPLUS-Dist-MM.t.....................FAILED
        11-12, 14, 17-18, 42
    ../lib/CPANPLUS/t/19_CPANPLUS-Dist.t........................FAILED
        62-63, 72

[perlio] -Duseithreads -Duse64bitint
    ../lib/CPANPLUS/t/04_CPANPLUS-Module.t......................FAILED
        109
    ../lib/CPANPLUS/Dist/Build/t/02_CPANPLUS-Dist-Build.t.......FAILED
        11-16, 20, 23, 26-31, 37
    ../lib/Archive/Extract/t/01_Archive-Extract.t...............FAILED
        35, 37-42, 61-66, 107, 109-110, 112-114
        131, 133-138, 157-162, 191, 193-198, 217-222
        239, 241-246, 265-270, 287, 289-294, 313-318
        347, 349-354, 373-378, 395, 397-398, 400-402
        419, 421-426, 445-450, 467, 469-470, 472-474
        527, 529-534, 553-558
    ../lib/CPANPLUS/t/20_CPANPLUS-Dist-MM.t.....................FAILED
        11-12, 14, 17-18, 42
    ../t/io/dup.t...............................................FAILED
        15-16
    ../t/io/open.t..............................................FAILED
        93
    ../lib/IPC/Cmd/t/01_IPC-Cmd.t...............................FAILED
        17-18, 23-24, 26-29, 34-35, 37-40, 45-46
        48-51, 56-57, 59-62, 67-68, 70-73, 78-79
        81-84, 89-90, 92-95, 100-101, 103-106, 111-112
        114-117, 122-123, 125-128, 133-134, 136-139
        144-145, 147-150, 155-156, 158-161, 166-167
        169-172, 177-178, 180-183, 188-189, 191-194
        199-200, 202-205, 210-211, 213-216, 221-222
        224-227, 232-233
    ../lib/CPANPLUS/t/19_CPANPLUS-Dist.t........................FAILED
        62-63

[stdio] -DDEBUGGING -Duseithreads -Duse64bitint
    ../lib/CPANPLUS/t/04_CPANPLUS-Module.t......................FAILED
        109
    ../lib/CPANPLUS/Dist/Build/t/02_CPANPLUS-Dist-Build.t.......FAILED
        11-16, 20, 23, 26-31, 37
    ../lib/Archive/Extract/t/01_Archive-Extract.t...............FAILED
        35, 37-42, 61-66, 107, 109-110, 112-114
        131, 133-138, 157-162, 191, 193-198, 217-222
        239, 241-246, 265-270, 287, 289-294, 313-318
        347, 349-354, 373-378, 395, 397-398, 400-402
        419, 421-426, 445-450, 467, 469-470, 472-474
        527, 529-534, 553-558
    ../lib/CPANPLUS/t/20_CPANPLUS-Dist-MM.t.....................FAILED
        7-9
    ../t/io/dup.t...............................................FAILED
        15-16
    ../t/io/open.t..............................................FAILED
        93
    ../lib/IPC/Cmd/t/01_IPC-Cmd.t...............................FAILED
        17-18, 23-24, 26-29, 34-35, 37-40, 45-46
        48-51, 56-57, 59-62, 67-68, 70-73, 78-79
        81-84, 89-90, 92-95, 100-101, 103-106, 111-112
        114-117, 122-123, 125-128, 133-134, 136-139
        144-145, 147-150, 155-156, 158-161, 166-167
        169-172, 177-178, 180-183, 188-189, 191-194
        199-200, 202-205, 210-211, 213-216, 221-222
        224-227, 232-233
    ../lib/CPANPLUS/t/19_CPANPLUS-Dist.t........................FAILED
        33, 62-63

[perlio] -DDEBUGGING -Duseithreads -Duse64bitint
    ../lib/CPANPLUS/t/04_CPANPLUS-Module.t......................FAILED
        109
    ../lib/CPANPLUS/Dist/Build/t/02_CPANPLUS-Dist-Build.t.......FAILED
        11-16, 20, 23, 26-31, 37
    ../lib/Archive/Extract/t/01_Archive-Extract.t...............FAILED
        35, 37-42, 61-66, 107, 109-110, 112-114
        131, 133-138, 157-162, 191, 193-198, 217-222
        239, 241-246, 265-270, 287, 289-294, 313-318
        347, 349-354, 373-378, 395, 397-398, 400-402
        419, 421-426, 445-450, 467, 469-470, 472-474
        527, 529-534, 553-558
    ../lib/CPANPLUS/t/20_CPANPLUS-Dist-MM.t.....................FAILED
        11-12, 14, 17-18, 42
    ../lib/CPANPLUS/t/19_CPANPLUS-Dist.t........................FAILED
        55
    ../t/io/dup.t...............................................FAILED
        15-16
    ../lib/IPC/Cmd/t/01_IPC-Cmd.t...............................FAILED
        17-18, 23-24, 26-29, 34-35, 37-40, 45-46
        48-51, 56-57, 59-62, 67-68, 70-73, 78-79
        81-84, 89-90, 92-95, 100-101, 103-106, 111-112
        114-117, 122-123, 125-128, 133-134, 136-139
        144-145, 147-150, 155-156, 158-161, 166-167
        169-172, 177-178, 180-183, 188-189, 191-194
        199-200, 202-205, 210-211, 213-216, 221-222
        224-227, 232-233
    ../t/io/open.t..............................................FAILED
        93

Compiler messages(gcc):
perlio.c: In function 'PerlIOStdio_set_ptrcnt':
perlio.c:3450: warning: pointer targets in assignment differ in signedness
Peek.c: In function 'XS_Devel__Peek_mstat':
Peek.c:391: warning: passing argument 1 of 'Perl_dump_mstats' discards qualifiers from pointer target type
<command line>:1:1: warning: "TIME_HIRES_STAT" redefined
<command line>:1:1: warning: this is the location of the previous definition
/usr/include/sys/cdefs_elf.h:67:20: error: missing binary operator before token "("
Peek.c:391: warning: passing argument 2 of 'Perl_dump_mstats' discards qualifiers from pointer target type

-- 
Report by Test::Smoke v1.39 build 1235 running on perl 5.10.0
(Reporter v0.035 / Smoker v0.044)



nntp.perl.org: Perl Programming lists via nntp and http.
Comments to Ask Bjørn Hansen at ask@perl.org | Group listing | About