develooper Front page | perl.perl5.porters | Postings from July 2009

Smoke [5.11.0] blead-1735-g781f5a3 FAIL(F) openvms V8.3-1H1 (IA64/2cpu)

From:
Craig A. Berry
Date:
July 31, 2009 11:11
Subject:
Smoke [5.11.0] blead-1735-g781f5a3 FAIL(F) openvms V8.3-1H1 (IA64/2cpu)
Message ID:
0KNN00KE2RTQYC90@asmtp022.mac.com
Automated smoke report for 5.11.0 patch 781f5a38a31daaa4e0bfc9110579971d8b7a7100 blead-1735-g781f5a3
ALMA: HP rx2600  (1.50GHz/6.0MB) (IA64/2 cpu)
    on        openvms - V8.3-1H1
    using     ? CC/DECC version 70390018
    smoketime 3 hours 43 minutes (average 1 hour 51 minutes)

Summary: FAIL(F)

O = OK  F = Failure(s), extended report at the bottom
X = Failure(s) under TEST but not under harness
? = still running or test results not (yet) available
Build failures during:       - = unknown or N/A
c = Configure, m = make, M = make (after miniperl), t = make test-prep

blead-1735-g781f5a3  Configuration (common) none
----------- ---------------------------------------------------------
F -         
F -         -Duseithreads
| +--------- -DDEBUGGING
+----------- no debugging


Locally applied patches:
    SMOKE781f5a38a31daaa4e0bfc9110579971d8b7a7100

Failures: (common-args) none
[default] 
    t/io/errno....................................................FAILED at test 2
    t/lib/deprecate...............................................FAILED--non-zero wait status: 1024
    lib/ExtUtils/t/Install........................................FAILED at test 15
    lib/Module/Build/t/debug......................................FAILED at test 3
    t/pod/diag....................................................FAILED--unexpected output at test 0
    31-JUL-2009 11:16:58.50   User: SMOKE            Process ID:   0003A267

[default] -Duseithreads
    t/io/errno....................................................FAILED at test 2
    t/lib/deprecate...............................................FAILED--non-zero wait status: 1024
    lib/ExtUtils/t/Installapi2....................................FAILED at test 15
    lib/ExtUtils/t/Install........................................FAILED at test 15
    lib/Module/Build/t/debug......................................FAILED at test 3
    t/pod/diag....................................................FAILED--unexpected output at test 0
    31-JUL-2009 13:15:29.80   User: SMOKE            Process ID:   0003C1A1

-- 
Report by Test::Smoke v1.39 build 1235 running on perl 5.10.0
(Reporter v0.035 / Smoker v0.044)



nntp.perl.org: Perl Programming lists via nntp and http.
Comments to Ask Bjørn Hansen at ask@perl.org | Group listing | About