develooper Front page | perl.perl5.porters | Postings from July 2009

Smoke [5.11.0] blead-1731-g28ccebc FAIL(F) MSWin32 WinXP/.Net SP3 (x86/2 cpu)

From:
Steve Hay
Date:
July 30, 2009 21:00
Subject:
Smoke [5.11.0] blead-1731-g28ccebc FAIL(F) MSWin32 WinXP/.Net SP3 (x86/2 cpu)
Message ID:
UKMAIL028P5o7P6umLr0000096d@ukmail02.planit.group
Automated smoke report for 5.11.0 patch 28ccebc469d90664106fcc1cb73d7321c4b60716 blead-1731-g28ccebc
maldoror.bath.planit.group: Intel(R) Core(TM)2 CPU 6700 @ 2.66GHz(~2660 MHz) (x86/2 cpu)
    on        MSWin32 - WinXP/.Net SP3
    using     cl version 14.00.50727.762
    smoketime 4 hours 58 minutes (average 29 minutes 49 seconds)

Summary: FAIL(F)

O = OK  F = Failure(s), extended report at the bottom
X = Failure(s) under TEST but not under harness
? = still running or test results not (yet) available
Build failures during:       - = unknown or N/A
c = Configure, m = make, M = make (after miniperl), t = make test-prep

blead-1731-g28ccebc  Configuration (common) -DCCTYPE=MSVC80 -DINST_TOP=$(INST_DRV)\Smoke\doesntexist
----------- ---------------------------------------------------------
O O         -Duselargefiles
O O         -Duselargefiles -Dusemymalloc
O O         -Duselargefiles -Duseithreads -Uuseimpsys
O O         -Duselargefiles -Duseithreads -Uuseimpsys -Dusemymalloc
F F         -Duselargefiles -Duseithreads
| +--------- -DDEBUGGING
+----------- no debugging


Locally applied patches:
    SMOKE28ccebc469d90664106fcc1cb73d7321c4b60716

Failures: (common-args) -DCCTYPE=MSVC80 -DINST_TOP=$(INST_DRV)\Smoke\doesntexist
[default] -Duselargefiles -Duseithreads
../t/op/reg_60508.t.........................................FAILED
../ext/IO/t/io_sock.t.......................................FAILED

[default] -DDEBUGGING -Duselargefiles -Duseithreads
../t/op/reg_60508.t.........................................FAILED
../ext/IO/t/io_sock.t.......................................FAILED
    25
    Bad plan.  You planned 26 tests but ran 25.

MANIFEST did not declare 'LIB/VERSION/INTERNALS.POD'
MANIFEST did not declare 'PORTING/GITUTILS.PM'

Compiler messages(MSWin32):
Cwd.xs(77) : warning C4101: 'symlink' : unreferenced local variable
ListUtil.xs(197) : warning C4101: 'magic' : unreferenced local variable

-- 
Report by Test::Smoke v1.39 build 1235 running on perl 5.11.0
(Reporter v0.035 / Smoker v0.044)




nntp.perl.org: Perl Programming lists via nntp and http.
Comments to Ask Bjørn Hansen at ask@perl.org | Group listing | About