develooper Front page | perl.perl5.porters | Postings from July 2009

Smoke [5.11.0] blead-1729-gee56566 FAIL(F) openvms V8.3-1H1 (IA64/2cpu)

Thread Next
From:
craigberry
Date:
July 30, 2009 16:15
Subject:
Smoke [5.11.0] blead-1729-gee56566 FAIL(F) openvms V8.3-1H1 (IA64/2cpu)
Message ID:
0KNM00B75B9SUX30@asmtp021.mac.com
Automated smoke report for 5.11.0 patch ee56566fc6aeac4fd679bd70846592145de67881 blead-1729-gee56566
ALMA: HP rx2600  (1.50GHz/6.0MB) (IA64/2 cpu)
    on        openvms - V8.3-1H1
    using     ? CC/DECC version 70390018
    smoketime 3 hours 44 minutes (average 1 hour 52 minutes)

Summary: FAIL(F)

O = OK  F = Failure(s), extended report at the bottom
X = Failure(s) under TEST but not under harness
? = still running or test results not (yet) available
Build failures during:       - = unknown or N/A
c = Configure, m = make, M = make (after miniperl), t = make test-prep

blead-1729-gee56566  Configuration (common) none
----------- ---------------------------------------------------------
F -         
F -         -Duseithreads
| +--------- -DDEBUGGING
+----------- no debugging


Locally applied patches:
    SMOKEee56566fc6aeac4fd679bd70846592145de67881

Failures: (common-args) none
[default] 
    t/io/errno....................................................FAILED at test 2
    t/lib/deprecate...............................................FAILED--non-zero wait status: 1024
    lib/ExtUtils/t/Install........................................FAILED at test 15
    lib/Module/Build/t/debug......................................FAILED at test 3
    t/pod/diag....................................................FAILED--unexpected output at test 0
    30-JUL-2009 15:05:39.31   User: SMOKE            Process ID:   000365C5

[default] -Duseithreads
    t/io/errno....................................................FAILED at test 2
    t/lib/deprecate...............................................FAILED--non-zero wait status: 1024
    ext/Time-HiRes/t/HiRes........................................FAILED--expected 40 tests, saw 33
    lib/ExtUtils/t/Installapi2....................................FAILED at test 15
    lib/ExtUtils/t/Install........................................FAILED at test 15
    lib/Module/Build/t/debug......................................FAILED at test 3
    t/pod/diag....................................................FAILED--unexpected output at test 0
    30-JUL-2009 17:04:00.39   User: SMOKE            Process ID:   0003850D

MANIFEST did not declare 'LIB/VERSION/INTERNALS.POD'
MANIFEST did not declare 'PORTING/GITUTILS.PM'

-- 
Report by Test::Smoke v1.39 build 1235 running on perl 5.10.0
(Reporter v0.035 / Smoker v0.044)

Thread Next


nntp.perl.org: Perl Programming lists via nntp and http.
Comments to Ask Bjørn Hansen at ask@perl.org | Group listing | About