develooper Front page | perl.perl5.porters | Postings from July 2009

Smoke [5.11.0] blead-1703-g9b05e87 FAIL(F) openbsd 4.5 (i386/1 cpu)

From:
Steven Schubiger
Date:
July 29, 2009 03:02
Subject:
Smoke [5.11.0] blead-1703-g9b05e87 FAIL(F) openbsd 4.5 (i386/1 cpu)
Message ID:
4a701e13.1818d00a.378a.5080@mx.google.com
Automated smoke report for 5.11.0 patch 9b05e874888db731870edce844ef9f3194eafed4 blead-1703-g9b05e87
p5openbsd: AMD Athlon(tm) Processor ("AuthenticAMD" 686-class, 256KB L2 cache) (909 MHz) (i386/1 cpu)
    on        openbsd - 4.5
    using     cc version 3.3.5 (propolice)
    smoketime 11 hours 50 minutes (average 1 hour 28 minutes)

Summary: FAIL(F)

O = OK  F = Failure(s), extended report at the bottom
X = Failure(s) under TEST but not under harness
? = still running or test results not (yet) available
Build failures during:       - = unknown or N/A
c = Configure, m = make, M = make (after miniperl), t = make test-prep

blead-1703-g9b05e87  Configuration (common) none
----------- ---------------------------------------------------------
F F F F     
F F F F     -Duse64bitint
F F F F     -Duseithreads
F F F F     -Duseithreads -Duse64bitint
| | | +----- PERLIO = perlio -DDEBUGGING
| | +------- PERLIO = stdio  -DDEBUGGING
| +--------- PERLIO = perlio
+----------- PERLIO = stdio


Locally applied patches:
    SMOKE9b05e874888db731870edce844ef9f3194eafed4

Failures: (common-args) none
[stdio/perlio] 
[stdio/perlio] -DDEBUGGING
[stdio/perlio] -Duse64bitint
[stdio/perlio] -DDEBUGGING -Duse64bitint
[stdio/perlio] -Duseithreads
[stdio] -DDEBUGGING -Duseithreads
[perlio] -Duseithreads -Duse64bitint
[stdio/perlio] -DDEBUGGING -Duseithreads -Duse64bitint
    ../lib/File/Copy.t..........................................FAILED
        Bad plan.  You planned 461 tests but ran 82.

[perlio] -DDEBUGGING -Duseithreads
    ../lib/File/Copy.t..........................................FAILED
        Bad plan.  You planned 461 tests but ran 82.
Inconsistent test results (between TEST and harness):
    ../t/io/errno.t.........................FAILED at test 9

[stdio] -Duseithreads -Duse64bitint
    ../lib/File/Copy.t..........................................FAILED
        Bad plan.  You planned 461 tests but ran 82.
Inconsistent test results (between TEST and harness):
    ../t/io/errno.t.........................FAILED at test 11

MANIFEST did not declare 'lib/version/Internals.pod'

Compiler messages(gcc):
Configure .../tmp//ccNqoNNi.o(.text+0x3e): In function `main':
/tmp//ccXqBHck.o(.text+0x5d): In function `main':
/tmp//cciBxTyD.o(.text+0x1c): In function `xxx':
/tmp//ccSGFDfA.o(.text+0xde): In function `main':
sv.o(.text+0x1d1b): In function `Perl_sv_2pv_flags':
libperl.a(DynaLoader.o)(.text+0x242): In function `XS_DynaLoader_dl_load_file':
libperl.a(sv.o)(.text+0x1d1b): In function `Perl_sv_2pv_flags':
<command line>:12:1: warning: "TIME_HIRES_STAT" redefined
<command line>:11:1: warning: this is the location of the previous definition
<command line>:13:1: warning: "TIME_HIRES_STAT" redefined
<command line>:12:1: warning: this is the location of the previous definition
util.o(.text+0x1b3): In function `savestr':
str.o(.text+0x5d): In function `str_2ptr':
../libperl.a(sv.o)(.text+0x1d1b): In function `Perl_sv_2pv_flags':
Configure .../tmp//ccxeNAyy.o(.text+0x3e): In function `main':
/home/sts/perl-current/UU/try.c:20: warning: sprintf() is often misused, please use snprintf()
/tmp//ccMHhhhk.o(.text+0x5d): In function `main':
/home/sts/perl-current/UU/try.c:29: warning: sprintf() is often misused, please use snprintf()
/tmp//ccmDzXnh.o(.text+0x1c): In function `xxx':
/home/sts/perl-current/UU/try.c:29: warning: vsprintf() is often misused, please use vsnprintf()
/tmp//ccWiYxow.o(.text+0xde): In function `main':
/home/sts/perl-current/UU/try.c:52: warning: sprintf() is often misused, please use snprintf()
sv.o(.text+0xb5ff): In function `Perl_sv_2pv_flags':
/home/sts/perl-current/sv.c:2751: warning: sprintf() is often misused, please use snprintf()
libperl.a(DynaLoader.o)(.text+0x556): In function `XS_DynaLoader_dl_load_file':
/home/sts/perl-current/ext/DynaLoader/DynaLoader.xs:171: warning: strcat() is almost always misused, please use strlcat()
libperl.a(sv.o)(.text+0xb5ff): In function `Perl_sv_2pv_flags':
<command line>:14:1: warning: "TIME_HIRES_STAT" redefined
<command line>:13:1: warning: this is the location of the previous definition
<command line>:15:1: warning: "TIME_HIRES_STAT" redefined
<command line>:14:1: warning: this is the location of the previous definition
util.o(.text+0x283): In function `savestr':
/home/sts/perl-current/x2p/util.c:147: warning: strcpy() is almost always misused, please use strlcpy()
str.o(.text+0x81): In function `str_2ptr':
/home/sts/perl-current/x2p/str.c:32: warning: sprintf() is often misused, please use snprintf()
../libperl.a(sv.o)(.text+0xb5ff): In function `Perl_sv_2pv_flags':
Configure .../tmp//ccKyYEYs.o(.text+0x3e): In function `main':
/tmp//ccHBREMk.o(.text+0x5d): In function `main':
/tmp//ccjIwAJx.o(.text+0x1c): In function `xxx':
/tmp//ccxWmXDq.o(.text+0xde): In function `main':
sv.o(.text+0x21e7): In function `Perl_sv_2pv_flags':
libperl.a(sv.o)(.text+0x21e7): In function `Perl_sv_2pv_flags':
../libperl.a(sv.o)(.text+0x21e7): In function `Perl_sv_2pv_flags':
Configure .../tmp//ccwhVJUi.o(.text+0x3e): In function `main':
/tmp//cclQuGcy.o(.text+0x5d): In function `main':
/tmp//ccKEzMEa.o(.text+0x1c): In function `xxx':
/tmp//ccnVwVGE.o(.text+0xde): In function `main':
sv.o(.text+0xab3a): In function `Perl_sv_2pv_flags':
libperl.a(DynaLoader.o)(.text+0x55a): In function `XS_DynaLoader_dl_load_file':
libperl.a(sv.o)(.text+0xab3a): In function `Perl_sv_2pv_flags':
../libperl.a(sv.o)(.text+0xab3a): In function `Perl_sv_2pv_flags':
Configure .../tmp//ccocEULC.o(.text+0x3e): In function `main':
/tmp//ccYxXIAo.o(.text+0x5d): In function `main':
/tmp//cceQzSbT.o(.text+0x1c): In function `xxx':
/tmp//ccVSBUwn.o(.text+0xde): In function `main':
sv.o(.text+0x1e63): In function `Perl_sv_2pv_flags':
libperl.a(DynaLoader.o)(.text+0x4aa): In function `XS_DynaLoader_dl_load_file':
libperl.a(sv.o)(.text+0x1e63): In function `Perl_sv_2pv_flags':
../libperl.a(sv.o)(.text+0x1e63): In function `Perl_sv_2pv_flags':
Configure .../tmp//ccoKIefT.o(.text+0x3e): In function `main':
/tmp//ccivLbvb.o(.text+0x5d): In function `main':
/tmp//ccinIJoK.o(.text+0x1c): In function `xxx':
/tmp//ccweySgh.o(.text+0xde): In function `main':
sv.o(.text+0xb827): In function `Perl_sv_2pv_flags':
libperl.a(DynaLoader.o)(.text+0x8de): In function `XS_DynaLoader_dl_load_file':
libperl.a(sv.o)(.text+0xb827): In function `Perl_sv_2pv_flags':
<command line>:16:1: warning: "TIME_HIRES_STAT" redefined
<command line>:15:1: warning: this is the location of the previous definition
../libperl.a(sv.o)(.text+0xb827): In function `Perl_sv_2pv_flags':
Configure .../tmp//ccaAjgPa.o(.text+0x3e): In function `main':
/tmp//ccEHreiz.o(.text+0x5d): In function `main':
/tmp//ccprWTwJ.o(.text+0x1c): In function `xxx':
/tmp//ccptsjDH.o(.text+0xde): In function `main':
sv.o(.text+0x231f): In function `Perl_sv_2pv_flags':
libperl.a(sv.o)(.text+0x231f): In function `Perl_sv_2pv_flags':
../libperl.a(sv.o)(.text+0x231f): In function `Perl_sv_2pv_flags':
Configure .../tmp//cceWcSvg.o(.text+0x3e): In function `main':
/tmp//ccwtfdmS.o(.text+0x5d): In function `main':
/tmp//ccFIFGNq.o(.text+0x1c): In function `xxx':
/tmp//ccAsABSB.o(.text+0xde): In function `main':
sv.o(.text+0xadb6): In function `Perl_sv_2pv_flags':
libperl.a(sv.o)(.text+0xadb6): In function `Perl_sv_2pv_flags':
../libperl.a(sv.o)(.text+0xadb6): In function `Perl_sv_2pv_flags':

-- 
Report by Test::Smoke v1.39 build 1235 running on perl 5.10.0
(Reporter v0.035 / Smoker v0.044)



nntp.perl.org: Perl Programming lists via nntp and http.
Comments to Ask Bjørn Hansen at ask@perl.org | Group listing | About