develooper Front page | perl.perl5.porters | Postings from July 2009

Smoke [5.11.0] blead-1692-g031cefa FAIL(XF) netbsd 5.0 (i386/1 cpu)

From:
Steven Schubiger
Date:
July 27, 2009 20:52
Subject:
Smoke [5.11.0] blead-1692-g031cefa FAIL(XF) netbsd 5.0 (i386/1 cpu)
Message ID:
4a6e75fd.0a04d00a.39ff.ffff87ae@mx.google.com
Automated smoke report for 5.11.0 patch 031cefa092a35217a3ac4abe595ffb31b4d6ec81 blead-1692-g031cefa
p5netbsd: Intel 686-class (i386/1 cpu)
    on        netbsd - 5.0
    using     cc version 4.1.3 20080704 prerelease (NetBSD nb2 20081120)
    smoketime 6 hours 18 minutes (average 47 minutes 17 seconds)

Summary: FAIL(XF)

O = OK  F = Failure(s), extended report at the bottom
X = Failure(s) under TEST but not under harness
? = still running or test results not (yet) available
Build failures during:       - = unknown or N/A
c = Configure, m = make, M = make (after miniperl), t = make test-prep

blead-1692-g031cefa  Configuration (common) none
----------- ---------------------------------------------------------
O O O O     
X O O X     -Duse64bitint
O O O O     -Duseithreads
O F O O     -Duseithreads -Duse64bitint
| | | +----- PERLIO = perlio -DDEBUGGING
| | +------- PERLIO = stdio  -DDEBUGGING
| +--------- PERLIO = perlio
+----------- PERLIO = stdio


Locally applied patches:
    SMOKE031cefa092a35217a3ac4abe595ffb31b4d6ec81

Failures: (common-args) none
[stdio] -Duse64bitint
Inconsistent test results (between TEST and harness):
    ../lib/Benchmark.t......................FAILED at test 127

[perlio] -DDEBUGGING -Duse64bitint
Inconsistent test results (between TEST and harness):
    ../lib/Benchmark.t......................FAILED at test 126

[perlio] -Duseithreads -Duse64bitint
    ../lib/Benchmark.t..........................................FAILED
        126-127

MANIFEST did not declare 'Porting/make_dot_patch.pl'

Compiler messages(gcc):
perlio.c: In function 'PerlIOStdio_set_ptrcnt':
perlio.c:3445: warning: pointer targets in assignment differ in signedness
<command line>:1:1: warning: "TIME_HIRES_STAT" redefined
<command line>:1:1: warning: this is the location of the previous definition
/usr/include/sys/cdefs_elf.h:67:20: error: missing binary operator before token "("

-- 
Report by Test::Smoke v1.39 build 1235 running on perl 5.10.0
(Reporter v0.035 / Smoker v0.044)



nntp.perl.org: Perl Programming lists via nntp and http.
Comments to Ask Bjørn Hansen at ask@perl.org | Group listing | About