develooper Front page | perl.perl5.porters | Postings from July 2009

Smoke [5.11.0] blead-1640-g4fffee8 FAIL(XF) linux 2.6.26-2-xen-686 [redhat] (i686/1 cpu)

From:
Steven Schubiger
Date:
July 22, 2009 15:32
Subject:
Smoke [5.11.0] blead-1640-g4fffee8 FAIL(XF) linux 2.6.26-2-xen-686 [redhat] (i686/1 cpu)
Message ID:
4a679356.0a1ad00a.13f1.612c@mx.google.com
Automated smoke report for 5.11.0 patch 4fffee8e5bc0dd2368ad605f2046c6a9a2303392 blead-1640-g4fffee8
p5centos: Intel(R) Pentium(R) 4 CPU 3.20GHz (GenuineIntel 3201MHz) (i686/1 cpu)
    on        linux - 2.6.26-2-xen-686 [redhat]
    using     cc version 4.1.2 20080704 (Red Hat 4.1.2-44)
    smoketime 11 hours 28 minutes (average 43 minutes 4 seconds)

Summary: FAIL(XF)

O = OK  F = Failure(s), extended report at the bottom
X = Failure(s) under TEST but not under harness
? = still running or test results not (yet) available
Build failures during:       - = unknown or N/A
c = Configure, m = make, M = make (after miniperl), t = make test-prep

blead-1640-g4fffee8  Configuration (common) none
----------- ---------------------------------------------------------
O O O O     
O O O O     -Duse64bitint
O O O O     -Duselongdouble
O O O O     -Dusemorebits
O O O F     -Duseithreads
O X F X     -Duseithreads -Duse64bitint
O O O O     -Duseithreads -Duselongdouble
O O O O     -Duseithreads -Dusemorebits
| | | +----- PERLIO = perlio -DDEBUGGING
| | +------- PERLIO = stdio  -DDEBUGGING
| +--------- PERLIO = perlio
+----------- PERLIO = stdio


Locally applied patches:
    SMOKE4fffee8e5bc0dd2368ad605f2046c6a9a2303392

Failures: (common-args) none
[perlio] -DDEBUGGING -Duseithreads
[stdio] -DDEBUGGING -Duseithreads -Duse64bitint
    ../lib/ExtUtils/t/Embed.t...................................FAILED
        1, 9

[perlio] -Duseithreads -Duse64bitint
Inconsistent test results (between TEST and harness):
    ../ext/Test-Harness/t/regression.t......FAILED--no leader found

[perlio] -DDEBUGGING -Duseithreads -Duse64bitint
Inconsistent test results (between TEST and harness):
    ../lib/ExtUtils/t/Embed.t...............FAILED at test 1

-- 
Report by Test::Smoke v1.39 build 1235 running on perl 5.8.8
(Reporter v0.035 / Smoker v0.044)



nntp.perl.org: Perl Programming lists via nntp and http.
Comments to Ask Bjørn Hansen at ask@perl.org | Group listing | About