develooper Front page | perl.perl5.porters | Postings from July 2009

Smoke [5.11.0] blead-1635-gbb74b0e FAIL(F) MSWin32 WinXP/.Net SP3 (x86/2 cpu)

From:
Steve Hay
Date:
July 21, 2009 19:54
Subject:
Smoke [5.11.0] blead-1635-gbb74b0e FAIL(F) MSWin32 WinXP/.Net SP3 (x86/2 cpu)
Message ID:
UKMAIL02Ex3AkwtsQzt000002fd@ukmail02.planit.group
Automated smoke report for 5.11.0 patch bb74b0ee4e732d7f05e2d9e9690a7ada65f6039e blead-1635-gbb74b0e
maldoror.bath.planit.group: Intel(R) Core(TM)2 CPU 6700 @ 2.66GHz(~2659 MHz) (x86/2 cpu)
    on        MSWin32 - WinXP/.Net SP3
    using     cl version 12.00.8804
    smoketime 3 hours 51 minutes (average 28 minutes 56 seconds)

Summary: FAIL(F)

O = OK  F = Failure(s), extended report at the bottom
X = Failure(s) under TEST but not under harness
? = still running or test results not (yet) available
Build failures during:       - = unknown or N/A
c = Configure, m = make, M = make (after miniperl), t = make test-prep

blead-1635-gbb74b0e  Configuration (common) -DINST_TOP=$(INST_DRV)\Smoke\doesntexist
----------- ---------------------------------------------------------
O O         -Duselargefiles
F O         -Duselargefiles -Duseithreads
F F         -Duselargefiles -Accflags='-DPERL_OLD_COPY_ON_WRITE'
F F         -Duselargefiles -Accflags='-DPERL_OLD_COPY_ON_WRITE' -Duseithreads
| +--------- -DDEBUGGING
+----------- no debugging


Locally applied patches:
    SMOKEbb74b0ee4e732d7f05e2d9e9690a7ada65f6039e

Failures: (common-args) -DINST_TOP=$(INST_DRV)\Smoke\doesntexist
[default] -Duselargefiles -Duseithreads
../ext/Socket/t/socketpair.t................................FAILED
../lib/File/stat.t..........................................FAILED
    61

[default] -Duselargefiles -Accflags='-DPERL_OLD_COPY_ON_WRITE'
[default] -DDEBUGGING -Duselargefiles -Accflags='-DPERL_OLD_COPY_ON_WRITE'
[default] -Duselargefiles -Accflags='-DPERL_OLD_COPY_ON_WRITE' -Duseithreads
[default] -DDEBUGGING -Duselargefiles -Accflags='-DPERL_OLD_COPY_ON_WRITE' -Duseithreads
../ext/Compress-Raw-Zlib/t/07bufsize.t......................FAILED
    Bad plan.  You planned 288 tests but ran 41.

Compiler messages(MSWin32):
Cwd.xs(77) : warning C4101: 'symlink' : unreferenced local variable
ListUtil.xs(197) : warning C4101: 'magic' : unreferenced local variable

-- 
Report by Test::Smoke v1.39 build 1235 running on perl 5.11.0
(Reporter v0.035 / Smoker v0.044)




nntp.perl.org: Perl Programming lists via nntp and http.
Comments to Ask Bjørn Hansen at ask@perl.org | Group listing | About