develooper Front page | perl.perl5.porters | Postings from June 2009

Smoke [5.11.0] blead-1480-g7f6de3f FAIL(XF) netbsd 5.0 (i386/1 cpu)

From:
Steven Schubiger
Date:
June 28, 2009 20:09
Subject:
Smoke [5.11.0] blead-1480-g7f6de3f FAIL(XF) netbsd 5.0 (i386/1 cpu)
Message ID:
1246246185.26647@p5netbsd
Automated smoke report for 5.11.0 patch 7f6de3fd9c6262f6bfca99202007be1dbe7ac758 blead-1480-g7f6de3f
p5netbsd: Intel 686-class (i386/1 cpu)
    on        netbsd - 5.0
    using     cc version 4.1.3 20080704 prerelease (NetBSD nb2 20081120)
    smoketime 5 hours 29 minutes (average 41 minutes 12 seconds)

Summary: FAIL(XF)

O = OK  F = Failure(s), extended report at the bottom
X = Failure(s) under TEST but not under harness
? = still running or test results not (yet) available
Build failures during:       - = unknown or N/A
c = Configure, m = make, M = make (after miniperl), t = make test-prep

blead-1480-g7f6de3f  Configuration (common) none
----------- ---------------------------------------------------------
O X X X     
O F O X     -Duse64bitint
O O X O     -Duseithreads
X O O X     -Duseithreads -Duse64bitint
| | | +----- PERLIO = perlio -DDEBUGGING
| | +------- PERLIO = stdio  -DDEBUGGING
| +--------- PERLIO = perlio
+----------- PERLIO = stdio


Locally applied patches:
    SMOKE7f6de3fd9c6262f6bfca99202007be1dbe7ac758

Failures: (common-args) none
[perlio] 
[stdio/perlio] -DDEBUGGING
[perlio] -DDEBUGGING -Duse64bitint
[stdio] -Duseithreads -Duse64bitint
[perlio] -DDEBUGGING -Duseithreads -Duse64bitint
Inconsistent test results (between TEST and harness):
    ../lib/Benchmark.t......................FAILED at test 126

[perlio] -Duse64bitint
    ../lib/Benchmark.t..........................................FAILED
        126-127

[stdio] -DDEBUGGING -Duseithreads
Inconsistent test results (between TEST and harness):
    ../lib/Benchmark.t......................FAILED at test 127

Compiler messages(gcc):
perlio.c: In function 'PerlIOStdio_set_ptrcnt':
perlio.c:3445: warning: pointer targets in assignment differ in signedness
<command line>:1:1: warning: "TIME_HIRES_STAT" redefined
<command line>:1:1: warning: this is the location of the previous definition
/usr/include/sys/cdefs_elf.h:67:20: error: missing binary operator before token "("

-- 
Report by Test::Smoke v1.39 build 1235 running on perl 5.10.0
(Reporter v0.035 / Smoker v0.044)



nntp.perl.org: Perl Programming lists via nntp and http.
Comments to Ask Bjørn Hansen at ask@perl.org | Group listing | About