develooper Front page | perl.perl5.porters | Postings from February 2009

Smoke [5.11.0] blead-691-g86bddcb FAIL(XF) netbsd 5.0_RC2 (i386/2 cpu)

From:
Ulrich Habel
Date:
February 24, 2009 00:27
Subject:
Smoke [5.11.0] blead-691-g86bddcb FAIL(XF) netbsd 5.0_RC2 (i386/2 cpu)
Message ID:
20090223195231.F0EBAE2E16@arkanum.pkgbox.org
Automated smoke report for 5.11.0 patch 86bddcbfaf2555223ec8fc596416d13d7a1a1118 blead-691-g86bddcb
hobbes.br.de: Intel 686-class (i386/2 cpu)
    on        netbsd - 5.0_RC2
    using     cc version 4.1.3 20080704 prerelease (NetBSD nb2 20081120)
    smoketime 3 hours 34 minutes (average 26 minutes 46 seconds)

Summary: FAIL(XF)

O = OK  F = Failure(s), extended report at the bottom
X = Failure(s) under TEST but not under harness
? = still running or test results not (yet) available
Build failures during:       - = unknown or N/A
c = Configure, m = make, M = make (after miniperl), t = make test-prep

blead-691-g86bddcb  Configuration (common) none
----------- ---------------------------------------------------------
O O O O     
O O O X     -Duse64bitint
O O O F     -Duseithreads
O O F O     -Duseithreads -Duse64bitint
| | | +----- PERLIO = perlio -DDEBUGGING
| | +------- PERLIO = stdio  -DDEBUGGING
| +--------- PERLIO = perlio
+----------- PERLIO = stdio


Locally applied patches:
    SMOKE86bddcbfaf2555223ec8fc596416d13d7a1a1118

Failures: (common-args) none
[perlio] -DDEBUGGING -Duse64bitint
Inconsistent test results (between TEST and harness):
    ../lib/Benchmark.t......................FAILED at test 126

[perlio] -DDEBUGGING -Duseithreads
    ../lib/Benchmark.t..........................................FAILED
        127

[stdio] -DDEBUGGING -Duseithreads -Duse64bitint
    ../lib/Benchmark.t..........................................FAILED
        126-127

Compiler messages(gcc):
perlio.c: In function 'PerlIOStdio_set_ptrcnt':
perlio.c:3453: warning: pointer targets in assignment differ in signedness
perlmini.c: In function 'S_incpush':
perlmini.c:4358: warning: unused variable 'addoldvers'
perl.c: In function 'S_incpush':
perl.c:4358: warning: unused variable 'addoldvers'
<command line>:1:1: warning: "TIME_HIRES_STAT" redefined
<command line>:1:1: warning: this is the location of the previous definition
/usr/include/sys/cdefs_elf.h:67:20: error: missing binary operator before token "("

-- 
Report by Test::Smoke v1.39 build 1235 running on perl 5.10.0
(Reporter v0.035 / Smoker v0.044)




nntp.perl.org: Perl Programming lists via nntp and http.
Comments to Ask Bjørn Hansen at ask@perl.org | Group listing | About