develooper Front page | perl.perl5.porters | Postings from February 2009

Smoke [5.11.0] 2009-02-18.15:32:09 FAIL(F) MSWin32 WinXP/.Net SP3 (x86/2 cpu)

From:
Steve Hay
Date:
February 18, 2009 22:13
Subject:
Smoke [5.11.0] 2009-02-18.15:32:09 FAIL(F) MSWin32 WinXP/.Net SP3 (x86/2 cpu)
Message ID:
UKMAIL026uIU1Gj03oH0000010e@ukmail02.planit.group
Automated smoke report for 5.11.0 patch 12865a2da083d2bfe48d969828043a3ca2652643 2009-02-18.15:32:09
maldoror.bath.planit.group: Intel(R) Core(TM)2 CPU 6700 @ 2.66GHz(~2660 MHz) (x86/2 cpu)
    on        MSWin32 - WinXP/.Net SP3
    using     cl version 13.10.3077
    smoketime 5 hours 39 minutes (average 16 minutes 58 seconds)

Summary: FAIL(F)

O = OK  F = Failure(s), extended report at the bottom
X = Failure(s) under TEST but not under harness
? = still running or test results not (yet) available
Build failures during:       - = unknown or N/A
c = Configure, m = make, M = make (after miniperl), t = make test-prep

2009-02-18.15:32:09  Configuration (common) -DCCTYPE=MSVC70FREE -DINST_TOP=$(INST_DRV)\Smoke\doesntexist
----------- ---------------------------------------------------------
O O         
O O         -Dusemymalloc
O O         -Duselargefiles
O O         -Duselargefiles -Dusemymalloc
O O         -Duseithreads -Uuseimpsys
O O         -Duseithreads -Uuseimpsys -Dusemymalloc
O O         -Duseithreads -Uuseimpsys -Duselargefiles
O O         -Duseithreads -Uuseimpsys -Duselargefiles -Dusemymalloc
F O         -Duseithreads
F O         -Duseithreads -Duselargefiles
| +--------- -DDEBUGGING
+----------- no debugging


Locally applied patches:
    SMOKE12865a2da083d2bfe48d969828043a3ca2652643

Failures: (common-args) -DCCTYPE=MSVC70FREE -DINST_TOP=$(INST_DRV)\Smoke\doesntexist
[default] -Duseithreads
io/perlio_leaks.t...........................................FAILED
../ext/Attribute-Handlers/t/linerep.t.......................FAILED
../ext/IO/t/io_sock.t.......................................FAILED

[default] -Duseithreads -Duselargefiles
io/perlio_leaks.t...........................................FAILED
../ext/Attribute-Handlers/t/linerep.t.......................FAILED
../ext/IO/t/io_sock.t.......................................FAILED
    25
    Bad plan.  You planned 26 tests but ran 25.

Compiler messages(MSWin32):
Cwd.xs(77) : warning C4101: 'symlink' : unreferenced local variable

-- 
Report by Test::Smoke v1.37 build 1217 running on perl 5.11.0
(Reporter v0.034 / Smoker v0.041)




nntp.perl.org: Perl Programming lists via nntp and http.
Comments to Ask Bjørn Hansen at ask@perl.org | Group listing | About