develooper Front page | perl.perl5.porters | Postings from January 2009

Smoke [5.11.0] 2009-01-27.22:03:08 FAIL(Ft) MSWin32 WinXP/.Net SP3 (x86/2 cpu)

From:
Steve Hay
Date:
January 27, 2009 20:53
Subject:
Smoke [5.11.0] 2009-01-27.22:03:08 FAIL(Ft) MSWin32 WinXP/.Net SP3 (x86/2 cpu)
Message ID:
UKMAIL02WwAeRaNgEpT000002e8@ukmail02.planit.group
Automated smoke report for 5.11.0 patch 23d483e2ac9eec5dd3415b4d8aad7ec7b0551ead 2009-01-27.22:03:08
maldoror.bath.planit.group: Intel(R) Core(TM)2 CPU 6700 @ 2.66GHz(~2660 MHz) (x86/2 cpu)
    on        MSWin32 - WinXP/.Net SP3
    using     cl version 12.00.8804
    smoketime 4 hours 20 minutes (average 13 minutes 1 seconds)

Summary: FAIL(Ft)

O = OK  F = Failure(s), extended report at the bottom
X = Failure(s) under TEST but not under harness
? = still running or test results not (yet) available
Build failures during:       - = unknown or N/A
c = Configure, m = make, M = make (after miniperl), t = make test-prep

2009-01-27.22:03:08  Configuration (common) -DINST_TOP=$(INST_DRV)\Smoke\doesntexist
----------- ---------------------------------------------------------
O O         
O O         -Dusemymalloc
O O         -Duseithreads -Uuseimpsys
O O         -Duseithreads -Uuseimpsys -Dusemymalloc
O O         -Duseithreads
F t         -Accflags='-DPERL_OLD_COPY_ON_WRITE'
F t         -Accflags='-DPERL_OLD_COPY_ON_WRITE' -Dusemymalloc
F t         -Accflags='-DPERL_OLD_COPY_ON_WRITE' -Duseithreads -Uuseimpsys
F t         -Accflags='-DPERL_OLD_COPY_ON_WRITE' -Duseithreads -Uuseimpsys -Dusemymalloc
F t         -Accflags='-DPERL_OLD_COPY_ON_WRITE' -Duseithreads
| +--------- -DDEBUGGING
+----------- no debugging


Locally applied patches:
    SMOKE23d483e2ac9eec5dd3415b4d8aad7ec7b0551ead

Failures: (common-args) -DINST_TOP=$(INST_DRV)\Smoke\doesntexist
[default] -Accflags='-DPERL_OLD_COPY_ON_WRITE'
[default] -Accflags='-DPERL_OLD_COPY_ON_WRITE' -Dusemymalloc
[default] -Accflags='-DPERL_OLD_COPY_ON_WRITE' -Duseithreads -Uuseimpsys
[default] -Accflags='-DPERL_OLD_COPY_ON_WRITE' -Duseithreads -Uuseimpsys -Dusemymalloc
[default] -Accflags='-DPERL_OLD_COPY_ON_WRITE' -Duseithreads
../ext/Compress/Raw/Zlib/t/07bufsize.t......................FAILED
    Bad plan.  You planned 288 tests but ran 41.
../ext/PerlIO/t/ioleaks.t...................................FAILED
../lib/Attribute/Handlers/t/linerep.t.......................FAILED

Compiler messages(MSWin32):
Cwd.xs(77) : warning C4101: 'symlink' : unreferenced local variable

-- 
Report by Test::Smoke v1.37 build 1217 running on perl 5.11.0
(Reporter v0.034 / Smoker v0.041)




nntp.perl.org: Perl Programming lists via nntp and http.
Comments to Ask Bjørn Hansen at ask@perl.org | Group listing | About