develooper Front page | perl.perl5.porters | Postings from January 2009

Smoke [5.11.0] 2009-01-26.15:08:08 FAIL(F) netbsd 5.0_BETA (i386/2 cpu)

From:
Ulrich Habel
Date:
January 27, 2009 05:26
Subject:
Smoke [5.11.0] 2009-01-26.15:08:08 FAIL(F) netbsd 5.0_BETA (i386/2 cpu)
Message ID:
20090127012516.2344BBB929@mail.habel.name
Automated smoke report for 5.11.0 patch 03050721b3bc3f299369ca775c64ffaf12c3508e 2009-01-26.15:08:08
smoker.pkgbox.org: Intel 686-class (i386/2 cpu)
    on        netbsd - 5.0_BETA
    using     cc version 4.1.3 20080704 prerelease (NetBSD nb2 20081120)
    smoketime 3 hours 58 minutes (average 29 minutes 51 seconds)

Summary: FAIL(F)

O = OK  F = Failure(s), extended report at the bottom
X = Failure(s) under TEST but not under harness
? = still running or test results not (yet) available
Build failures during:       - = unknown or N/A
c = Configure, m = make, M = make (after miniperl), t = make test-prep

2009-01-26.15:08:08  Configuration (common) none
----------- ---------------------------------------------------------
F F F F     
F F F F     -Duse64bitint
F F F F     -Duseithreads
F F F F     -Duseithreads -Duse64bitint
| | | +----- PERLIO = perlio -DDEBUGGING
| | +------- PERLIO = stdio  -DDEBUGGING
| +--------- PERLIO = perlio
+----------- PERLIO = stdio


Locally applied patches:
    SMOKE03050721b3bc3f299369ca775c64ffaf12c3508e

Failures: (common-args) none
[stdio/perlio] 
[stdio/perlio] -DDEBUGGING
[stdio/perlio] -Duse64bitint
[stdio/perlio] -DDEBUGGING -Duse64bitint
[stdio] -Duseithreads
[stdio/perlio] -DDEBUGGING -Duseithreads
[stdio/perlio] -Duseithreads -Duse64bitint
[stdio/perlio] -DDEBUGGING -Duseithreads -Duse64bitint
    ../lib/File/Copy.t..........................................FAILED
        Bad plan.  You planned 451 tests but ran 76.

[perlio] -Duseithreads
    ../lib/File/Copy.t..........................................FAILED
        Bad plan.  You planned 451 tests but ran 76.
Inconsistent test results (between TEST and harness):
    ../t/op/threads.t.......................FAILED--expected 13 tests, saw 9

Compiler messages(gcc):
time64.c: In function 'localtime64_r':
time64.c:509: warning: this decimal constant is unsigned only in ISO C90
perlio.c: In function 'PerlIOStdio_set_ptrcnt':
perlio.c:3453: warning: pointer targets in assignment differ in signedness
<command line>:1:1: warning: "TIME_HIRES_STAT" redefined
<command line>:1:1: warning: this is the location of the previous definition
/usr/include/sys/cdefs_elf.h:67:20: error: missing binary operator before token "("

-- 
Report by Test::Smoke v1.37 build 1217 running on perl 5.10.0
(Reporter v0.034 / Smoker v0.041)




nntp.perl.org: Perl Programming lists via nntp and http.
Comments to Ask Bjørn Hansen at ask@perl.org | Group listing | About