develooper Front page | perl.perl5.porters | Postings from January 2009

Smoke [5.11.0] 2009-01-24.17:47:07 FAIL(F) MSWin32 WinXP/.Net SP3 (x86/2 cpu)

From:
Steve Hay
Date:
January 24, 2009 22:05
Subject:
Smoke [5.11.0] 2009-01-24.17:47:07 FAIL(F) MSWin32 WinXP/.Net SP3 (x86/2 cpu)
Message ID:
UKMAIL027kBnccYTjr8000000a3@ukmail02.planit.group
Automated smoke report for 5.11.0 patch 8c4561fbb4b02a2171ebce641e7cb62696b86417 2009-01-24.17:47:07
maldoror.bath.planit.group: Intel(R) Core(TM)2 CPU 6700 @ 2.66GHz(~2660 MHz) (x86/2 cpu)
    on        MSWin32 - WinXP/.Net SP3
    using     bcc32 version 5.5.1
    smoketime 5 hours 35 minutes (average 16 minutes 47 seconds)

Summary: FAIL(F)

O = OK  F = Failure(s), extended report at the bottom
X = Failure(s) under TEST but not under harness
? = still running or test results not (yet) available
Build failures during:       - = unknown or N/A
c = Configure, m = make, M = make (after miniperl), t = make test-prep

2009-01-24.17:47:07  Configuration (common) -DCCTYPE=BORLAND -DINST_TOP=$(INST_DRV)\Smoke\doesntexist
----------- ---------------------------------------------------------
O O         
O O         -Dusemymalloc
O O         -Duselargefiles
O O         -Duselargefiles -Dusemymalloc
O O         -Duseithreads -Uuseimpsys
O O         -Duseithreads -Uuseimpsys -Dusemymalloc
O F         -Duseithreads -Uuseimpsys -Duselargefiles
O O         -Duseithreads -Uuseimpsys -Duselargefiles -Dusemymalloc
F O         -Duseithreads
O F         -Duseithreads -Duselargefiles
| +--------- -DDEBUGGING
+----------- no debugging


Locally applied patches:
    SMOKE8c4561fbb4b02a2171ebce641e7cb62696b86417

Failures: (common-args) -DCCTYPE=BORLAND -DINST_TOP=$(INST_DRV)\Smoke\doesntexist
[default] -DDEBUGGING -Duseithreads -Uuseimpsys -Duselargefiles
../ext/Encode/t/grow.t......................................FAILED
../ext/PerlIO/t/ioleaks.t...................................FAILED
../lib/Attribute/Handlers/t/linerep.t.......................FAILED

[default] -Duseithreads
../ext/IO/t/io_sock.t.......................................FAILED
../ext/PerlIO/t/ioleaks.t...................................FAILED
../lib/Attribute/Handlers/t/linerep.t.......................FAILED

[default] -DDEBUGGING -Duseithreads -Duselargefiles
../ext/IO/t/io_sock.t.......................................FAILED
    25
    Bad plan.  You planned 26 tests but ran 25.
../ext/PerlIO/t/ioleaks.t...................................FAILED
../lib/Attribute/Handlers/t/linerep.t.......................FAILED

Compiler messages(bcc32):
Warning W8072 ..\time64.c 260: Suspicious pointer arithmetic in function safe_year
Warning W8008 crc32.c 232: Condition is always true in function crc32
Warning W8066 crc32.c 242: Unreachable code in function crc32
Warning W8004 deflate.c 351: 'hash_head' is assigned a value that is never used in function deflateSetDictionary
Warning W8008 deflate.c 1278: Condition is always false in function fill_window
Warning W8066 deflate.c 1279: Unreachable code in function fill_window
Warning W8004 deflate.c 1669: 'bflush' is assigned a value that is never used in function deflate_slow

-- 
Report by Test::Smoke v1.37 build 1217 running on perl 5.11.0
(Reporter v0.034 / Smoker v0.041)




nntp.perl.org: Perl Programming lists via nntp and http.
Comments to Ask Bjørn Hansen at ask@perl.org | Group listing | About