develooper Front page | perl.perl5.porters | Postings from December 2008

Smoke [5.10.0] 35109 FAIL(F) MSWin32 WinXP/.Net SP3 (x86/2 cpu)

From:
Steve Hay
Date:
December 15, 2008 17:06
Subject:
Smoke [5.10.0] 35109 FAIL(F) MSWin32 WinXP/.Net SP3 (x86/2 cpu)
Message ID:
UKMAIL02Hmj9n1xxWn90000046d@ukmail02.planit.group
Automated smoke report for 5.10.0 patch 35109
maldoror.bath.planit.group: Intel(R) Core(TM)2 CPU 6700 @ 2.66GHz(~2660 MHz) (x86/2 cpu)
    on        MSWin32 - WinXP/.Net SP3
    using     cl version 12.00.8804
    smoketime 5 hours 54 minutes (average 17 minutes 44 seconds)

Summary: FAIL(F)

O = OK  F = Failure(s), extended report at the bottom
X = Failure(s) under TEST but not under harness
? = still running or test results not (yet) available
Build failures during:       - = unknown or N/A
c = Configure, m = make, M = make (after miniperl), t = make test-prep

   35109     Configuration (common) -DINST_TOP=$(INST_DRV)\Smoke\doesntexist
----------- ---------------------------------------------------------
F F         
F F         -Dusemymalloc
F F         -Duselargefiles
F F         -Duselargefiles -Dusemymalloc
F F         -Duseithreads -Uuseimpsys
F F         -Duseithreads -Uuseimpsys -Dusemymalloc
F F         -Duseithreads -Uuseimpsys -Duselargefiles
F F         -Duseithreads -Uuseimpsys -Duselargefiles -Dusemymalloc
F F         -Duseithreads
F F         -Duseithreads -Duselargefiles
| +--------- -DDEBUGGING
+----------- no debugging


Locally applied patches:
    MAINT34992
    SMOKE35109

Failures: (common-args) -DINST_TOP=$(INST_DRV)\Smoke\doesntexist
[default] 
[default] -DDEBUGGING
[default] -Dusemymalloc
[default] -DDEBUGGING -Dusemymalloc
[default] -Duselargefiles
[default] -DDEBUGGING -Duselargefiles
[default] -Duselargefiles -Dusemymalloc
[default] -DDEBUGGING -Duselargefiles -Dusemymalloc
[default] -Duseithreads -Uuseimpsys
[default] -DDEBUGGING -Duseithreads -Uuseimpsys
[default] -Duseithreads -Uuseimpsys -Dusemymalloc
[default] -DDEBUGGING -Duseithreads -Uuseimpsys -Dusemymalloc
[default] -Duseithreads -Uuseimpsys -Duselargefiles
[default] -DDEBUGGING -Duseithreads -Uuseimpsys -Duselargefiles
[default] -Duseithreads -Uuseimpsys -Duselargefiles -Dusemymalloc
[default] -DDEBUGGING -Duseithreads -Uuseimpsys -Duselargefiles -Dusemymalloc
[default] -Duseithreads
[default] -DDEBUGGING -Duseithreads
[default] -Duseithreads -Duselargefiles
[default] -DDEBUGGING -Duseithreads -Duselargefiles
../ext/Test/Harness/t/prove.t...............................FAILED
    83, 112, 141, 170, 199, 228, 257, 286, 315
    344, 373, 402, 431, 460, 489, 518, 547
    576, 605, 634, 663, 692, 722, 752, 782
    812, 842, 872, 902, 932, 962, 992, 1022
    1052, 1082, 1112, 1142, 1172, 1202, 1232
    1262, 1292, 1322, 1352, 1382, 1412, 1442
    1472, 1503, 1534, 1565, 1596
../lib/Pod/t/text-encoding.t................................FAILED
    2-4
../lib/Test/Simple/t/exit.t.................................FAILED
    1
../lib/Test/Simple/t/filehandles.t..........................FAILED
    Bad plan.  You planned 1 tests but ran 0.

MANIFEST declared 'T/LIB/APP/PROVE/PLUGIN/DUMMY.PM' but it is missing

Compiler messages(MSWin32):
..\regcomp.c(4154) : warning C4028: formal parameter 2 different from declaration
Cwd.xs(77) : warning C4101: 'symlink' : unreferenced local variable
re_comp.c(4154) : warning C4028: formal parameter 2 different from declaration
..\regcomp.c(4154) : warning C4028: formal parameter 3 different from declaration
re_comp.c(4154) : warning C4028: formal parameter 3 different from declaration

-- 
Report by Test::Smoke v1.36 build 1210 running on perl 5.11.0
(Reporter v0.033 / Smoker v0.041)




nntp.perl.org: Perl Programming lists via nntp and http.
Comments to Ask Bjørn Hansen at ask@perl.org | Group listing | About