develooper Front page | perl.perl5.porters | Postings from August 2008

Smoke [5.11.0] 34218 FAIL(F) MSWin32 WinXP/.Net SP3 (x86/2 cpu)

From:
Steve Hay
Date:
August 23, 2008 20:39
Subject:
Smoke [5.11.0] 34218 FAIL(F) MSWin32 WinXP/.Net SP3 (x86/2 cpu)
Message ID:
UKMAIL02Z2y2Fko8C7w000005e0@ukmail02.planit.group
Automated smoke report for 5.11.0 patch 34218
maldoror.bath.planit.group: Intel(R) Core(TM)2 CPU 6700 @ 2.66GHz(~2660 MHz) (x86/2 cpu)
    on        MSWin32 - WinXP/.Net SP3
    using     bcc32 version 5.5.1
    smoketime 5 hours 57 minutes (average 17 minutes 54 seconds)

Summary: FAIL(F)

O = OK  F = Failure(s), extended report at the bottom
X = Failure(s) under TEST but not under harness
? = still running or test results not (yet) available
Build failures during:       - = unknown or N/A
c = Configure, m = make, M = make (after miniperl), t = make test-prep

   34218     Configuration (common) -DCCTYPE=BORLAND -DINST_TOP=$(INST_DRV)\Smoke\doesntexist
----------- ---------------------------------------------------------
F F         
F F         -Dusemymalloc
F F         -Duselargefiles
F F         -Duselargefiles -Dusemymalloc
F F         -Duseithreads -Uuseimpsys
F F         -Duseithreads -Uuseimpsys -Dusemymalloc
F F         -Duseithreads -Uuseimpsys -Duselargefiles
F F         -Duseithreads -Uuseimpsys -Duselargefiles -Dusemymalloc
F F         -Duseithreads
F F         -Duseithreads -Duselargefiles
| +--------- -DDEBUGGING
+----------- no debugging


Locally applied patches:
    DEVEL
    SMOKE34218

Failures: (common-args) -DCCTYPE=BORLAND -DINST_TOP=$(INST_DRV)\Smoke\doesntexist
[default] 
[default] -DDEBUGGING
[default] -Dusemymalloc
[default] -DDEBUGGING -Dusemymalloc
[default] -Duselargefiles
[default] -DDEBUGGING -Duselargefiles
[default] -Duselargefiles -Dusemymalloc
[default] -Duseithreads -Uuseimpsys
[default] -DDEBUGGING -Duseithreads -Uuseimpsys
[default] -DDEBUGGING -Duseithreads -Uuseimpsys -Dusemymalloc
[default] -Duseithreads -Uuseimpsys -Duselargefiles
[default] -DDEBUGGING -Duseithreads -Uuseimpsys -Duselargefiles
[default] -Duseithreads -Uuseimpsys -Duselargefiles -Dusemymalloc
[default] -DDEBUGGING -Duseithreads -Uuseimpsys -Duselargefiles -Dusemymalloc
[default] -Duseithreads
[default] -DDEBUGGING -Duseithreads
[default] -DDEBUGGING -Duseithreads -Duselargefiles
op/local.t..................................................FAILED
    121
../ext/Test/Harness/t/prove.t...............................FAILED
    83, 112, 141, 170, 199, 228, 257, 286, 315
    344, 373, 402, 431, 460, 489, 518, 547
    576, 605, 634, 663, 692, 722, 752, 782
    812, 842, 872, 902, 932, 962, 992, 1022
    1052, 1082, 1112, 1142, 1172, 1202, 1232
    1262, 1292, 1322, 1352, 1382, 1412, 1442
    1472, 1503, 1534, 1565, 1596
../lib/CGI/t/upload.t.......................................FAILED
    No plan found in TAP output
../lib/CGI/t/uploadInfo.t...................................FAILED
    No plan found in TAP output

[default] -DDEBUGGING -Duselargefiles -Dusemymalloc
[default] -Duseithreads -Uuseimpsys -Dusemymalloc
op/local.t..................................................FAILED
    121
op/tiehandle.t..............................................FAILED
    No plan found in TAP output
../ext/Test/Harness/t/prove.t...............................FAILED
    83, 112, 141, 170, 199, 228, 257, 286, 315
    344, 373, 402, 431, 460, 489, 518, 547
    576, 605, 634, 663, 692, 722, 752, 782
    812, 842, 872, 902, 932, 962, 992, 1022
    1052, 1082, 1112, 1142, 1172, 1202, 1232
    1262, 1292, 1322, 1352, 1382, 1412, 1442
    1472, 1503, 1534, 1565, 1596
../lib/CGI/t/upload.t.......................................FAILED
    No plan found in TAP output
../lib/CGI/t/uploadInfo.t...................................FAILED
    No plan found in TAP output

[default] -Duseithreads -Duselargefiles
op/local.t..................................................FAILED
    121
../ext/IO/t/io_sock.t.......................................FAILED
../ext/Test/Harness/t/prove.t...............................FAILED
    83, 112, 141, 170, 199, 228, 257, 286, 315
    344, 373, 402, 431, 460, 489, 518, 547
    576, 605, 634, 663, 692, 722, 752, 782
    812, 842, 872, 902, 932, 962, 992, 1022
    1052, 1082, 1112, 1142, 1172, 1202, 1232
    1262, 1292, 1322, 1352, 1382, 1412, 1442
    1472, 1503, 1534, 1565, 1596
../lib/CGI/t/upload.t.......................................FAILED
    No plan found in TAP output
../lib/CGI/t/uploadInfo.t...................................FAILED
    No plan found in TAP output

Compiler messages(bcc32):
Warning W8008 crc32.c 232: Condition is always true in function crc32
Warning W8066 crc32.c 242: Unreachable code in function crc32
Warning W8004 deflate.c 351: 'hash_head' is assigned a value that is never used in function deflateSetDictionary
Warning W8008 deflate.c 1278: Condition is always false in function fill_window
Warning W8066 deflate.c 1279: Unreachable code in function fill_window
Warning W8004 deflate.c 1669: 'bflush' is assigned a value that is never used in function deflate_slow

-- 
Report by Test::Smoke v1.35 build 1199 running on perl 5.11.0
(Reporter v0.033 / Smoker v0.041)




nntp.perl.org: Perl Programming lists via nntp and http.
Comments to Ask Bjørn Hansen at ask@perl.org | Group listing | About