develooper Front page | perl.perl5.porters | Postings from August 2008

Smoke [5.11.0] 34203 FAIL(F) MSWin32 WinXP/.Net SP3 (x86/2 cpu)

Thread Previous
From:
Steve Hay
Date:
August 16, 2008 21:06
Subject:
Smoke [5.11.0] 34203 FAIL(F) MSWin32 WinXP/.Net SP3 (x86/2 cpu)
Message ID:
UKMAIL02lJc0xvlUQ9c00000173@ukmail02.planit.group
Automated smoke report for 5.11.0 patch 34203
maldoror.bath.planit.group: Intel(R) Core(TM)2 CPU 6700 @ 2.66GHz(~2660 MHz) (x86/2 cpu)
    on        MSWin32 - WinXP/.Net SP3
    using     bcc32 version 5.5.1
    smoketime 6 hours 7 minutes (average 18 minutes 23 seconds)

Summary: FAIL(F)

O = OK  F = Failure(s), extended report at the bottom
X = Failure(s) under TEST but not under harness
? = still running or test results not (yet) available
Build failures during:       - = unknown or N/A
c = Configure, m = make, M = make (after miniperl), t = make test-prep

   34203     Configuration (common) -DCCTYPE=BORLAND -DINST_TOP=$(INST_DRV)\Smoke\doesntexist
----------- ---------------------------------------------------------
F F         
F F         -Dusemymalloc
F F         -Duselargefiles
F F         -Duselargefiles -Dusemymalloc
F F         -Duseithreads -Uuseimpsys
F F         -Duseithreads -Uuseimpsys -Dusemymalloc
F F         -Duseithreads -Uuseimpsys -Duselargefiles
F F         -Duseithreads -Uuseimpsys -Duselargefiles -Dusemymalloc
F F         -Duseithreads
F F         -Duseithreads -Duselargefiles
| +--------- -DDEBUGGING
+----------- no debugging


Locally applied patches:
    DEVEL
    SMOKE34203

Failures: (common-args) -DCCTYPE=BORLAND -DINST_TOP=$(INST_DRV)\Smoke\doesntexist
[default] 
comp/multiline.t............................................FAILED
    5-6
op/local.t..................................................FAILED
    121
op/rand.t...................................................FAILED
    5
../lib/Test/Harness/t/prove.t...............................FAILED
    83, 112, 141, 170, 199, 228, 257, 286, 315
    344, 373, 402, 431, 460, 489, 518, 547
    576, 605, 634, 663, 692, 722, 752, 782
    812, 842, 872, 902, 932, 962, 992, 1022
    1052, 1082, 1112, 1142, 1172, 1202, 1232
    1262, 1292, 1322, 1352, 1382, 1412, 1442
    1472, 1503, 1534, 1565, 1596

[default] -DDEBUGGING
[default] -Dusemymalloc
[default] -DDEBUGGING -Dusemymalloc
[default] -Duselargefiles
[default] -DDEBUGGING -Duselargefiles
[default] -Duselargefiles -Dusemymalloc
[default] -DDEBUGGING -Duselargefiles -Dusemymalloc
[default] -Duseithreads -Uuseimpsys
[default] -DDEBUGGING -Duseithreads -Uuseimpsys
[default] -Duseithreads -Uuseimpsys -Dusemymalloc
[default] -DDEBUGGING -Duseithreads -Uuseimpsys -Dusemymalloc
[default] -Duseithreads -Uuseimpsys -Duselargefiles
[default] -DDEBUGGING -Duseithreads -Uuseimpsys -Duselargefiles
[default] -Duseithreads -Uuseimpsys -Duselargefiles -Dusemymalloc
[default] -DDEBUGGING -Duseithreads -Uuseimpsys -Duselargefiles -Dusemymalloc
[default] -Duseithreads
[default] -DDEBUGGING -Duseithreads
[default] -Duseithreads -Duselargefiles
[default] -DDEBUGGING -Duseithreads -Duselargefiles
comp/multiline.t............................................FAILED
    5-6
op/local.t..................................................FAILED
    121
../lib/Test/Harness/t/prove.t...............................FAILED
    83, 112, 141, 170, 199, 228, 257, 286, 315
    344, 373, 402, 431, 460, 489, 518, 547
    576, 605, 634, 663, 692, 722, 752, 782
    812, 842, 872, 902, 932, 962, 992, 1022
    1052, 1082, 1112, 1142, 1172, 1202, 1232
    1262, 1292, 1322, 1352, 1382, 1412, 1442
    1472, 1503, 1534, 1565, 1596

Compiler messages(bcc32):
Warning W8008 crc32.c 232: Condition is always true in function crc32
Warning W8066 crc32.c 242: Unreachable code in function crc32
Warning W8004 deflate.c 351: 'hash_head' is assigned a value that is never used in function deflateSetDictionary
Warning W8008 deflate.c 1278: Condition is always false in function fill_window
Warning W8066 deflate.c 1279: Unreachable code in function fill_window
Warning W8004 deflate.c 1669: 'bflush' is assigned a value that is never used in function deflate_slow

-- 
Report by Test::Smoke v1.34 build 1193 running on perl 5.11.0
(Reporter v0.033 / Smoker v0.040)


Thread Previous


nntp.perl.org: Perl Programming lists via nntp and http.
Comments to Ask Bjørn Hansen at ask@perl.org | Group listing | About