develooper Front page | perl.perl5.porters | Postings from August 2008

Smoke [5.11.0] 34202 FAIL(Ft) MSWin32 WinXP/.Net SP3 (x86/2 cpu)

From:
Steve Hay
Date:
August 12, 2008 19:28
Subject:
Smoke [5.11.0] 34202 FAIL(Ft) MSWin32 WinXP/.Net SP3 (x86/2 cpu)
Message ID:
UKMAIL02giwHsqhA53Z00003db4@ukmail02.planit.group
Automated smoke report for 5.11.0 patch 34202
maldoror.bath.planit.group: Intel(R) Core(TM)2 CPU 6700 @ 2.66GHz(~2660 MHz) (x86/2 cpu)
    on        MSWin32 - WinXP/.Net SP3
    using     cl version 12.00.8804
    smoketime 4 hours 27 minutes (average 13 minutes 21 seconds)

Summary: FAIL(Ft)

O = OK  F = Failure(s), extended report at the bottom
X = Failure(s) under TEST but not under harness
? = still running or test results not (yet) available
Build failures during:       - = unknown or N/A
c = Configure, m = make, M = make (after miniperl), t = make test-prep

   34202     Configuration (common) -DINST_TOP=$(INST_DRV)\Smoke\doesntexist
----------- ---------------------------------------------------------
F F         
F F         -Dusemymalloc
F F         -Duseithreads -Uuseimpsys
F F         -Duseithreads -Uuseimpsys -Dusemymalloc
F F         -Duseithreads
F t         -Accflags='-DPERL_OLD_COPY_ON_WRITE'
F t         -Accflags='-DPERL_OLD_COPY_ON_WRITE' -Dusemymalloc
F t         -Accflags='-DPERL_OLD_COPY_ON_WRITE' -Duseithreads -Uuseimpsys
F t         -Accflags='-DPERL_OLD_COPY_ON_WRITE' -Duseithreads -Uuseimpsys -Dusemymalloc
F t         -Accflags='-DPERL_OLD_COPY_ON_WRITE' -Duseithreads
| +--------- -DDEBUGGING
+----------- no debugging


Locally applied patches:
    DEVEL
    SMOKE34202

Failures: (common-args) -DINST_TOP=$(INST_DRV)\Smoke\doesntexist
[default] 
[default] -DDEBUGGING
[default] -Dusemymalloc
[default] -DDEBUGGING -Dusemymalloc
[default] -Duseithreads -Uuseimpsys
[default] -DDEBUGGING -Duseithreads -Uuseimpsys
[default] -Duseithreads -Uuseimpsys -Dusemymalloc
[default] -DDEBUGGING -Duseithreads -Uuseimpsys -Dusemymalloc
[default] -Duseithreads
[default] -DDEBUGGING -Duseithreads
comp/multiline.t............................................FAILED
    5-6
op/local.t..................................................FAILED
    121
../lib/Test/Harness/t/prove.t...............................FAILED
    83, 112, 141, 170, 199, 228, 257, 286, 315
    344, 373, 402, 431, 460, 489, 518, 547
    576, 605, 634, 663, 692, 722, 752, 782
    812, 842, 872, 902, 932, 962, 992, 1022
    1052, 1082, 1112, 1142, 1172, 1202, 1232
    1262, 1292, 1322, 1352, 1382, 1412, 1442
    1472, 1503, 1534, 1565, 1596

[default] -Accflags='-DPERL_OLD_COPY_ON_WRITE'
[default] -Accflags='-DPERL_OLD_COPY_ON_WRITE' -Dusemymalloc
[default] -Accflags='-DPERL_OLD_COPY_ON_WRITE' -Duseithreads -Uuseimpsys
[default] -Accflags='-DPERL_OLD_COPY_ON_WRITE' -Duseithreads -Uuseimpsys -Dusemymalloc
[default] -Accflags='-DPERL_OLD_COPY_ON_WRITE' -Duseithreads
comp/multiline.t............................................FAILED
    5-6
op/local.t..................................................FAILED
    121
../ext/Compress/Raw/Zlib/t/07bufsize.t......................FAILED
    Bad plan.  You planned 288 tests but ran 41.
../lib/Test/Harness/t/prove.t...............................FAILED
    83, 112, 141, 170, 199, 228, 257, 286, 315
    344, 373, 402, 431, 460, 489, 518, 547
    576, 605, 634, 663, 692, 722, 752, 782
    812, 842, 872, 902, 932, 962, 992, 1022
    1052, 1082, 1112, 1142, 1172, 1202, 1232
    1262, 1292, 1322, 1352, 1382, 1412, 1442
    1472, 1503, 1534, 1565, 1596

-- 
Report by Test::Smoke v1.34 build 1193 running on perl 5.11.0
(Reporter v0.033 / Smoker v0.040)




nntp.perl.org: Perl Programming lists via nntp and http.
Comments to Ask Bjørn Hansen at ask@perl.org | Group listing | About