develooper Front page | perl.perl5.porters | Postings from July 2008

Smoke [5.11.0] 34101 FAIL(F) MSWin32 WinXP/.Net SP3 (x86/2 cpu)

From:
Steve Hay
Date:
July 12, 2008 16:25
Subject:
Smoke [5.11.0] 34101 FAIL(F) MSWin32 WinXP/.Net SP3 (x86/2 cpu)
Message ID:
UKMAIL02o7P6umLrXWq0000278c@ukmail02.planit.group
Automated smoke report for 5.11.0 patch 34101
maldoror.bath.planit.group: Intel(R) Core(TM)2 CPU 6700 @ 2.66GHz(~2660 MHz) (x86/2 cpu)
    on        MSWin32 - WinXP/.Net SP3
    using     cl version 15.00.21022.08
    smoketime 5 hours 51 minutes (average 17 minutes 34 seconds)

Summary: FAIL(F)

O = OK  F = Failure(s), extended report at the bottom
X = Failure(s) under TEST but not under harness
? = still running or test results not (yet) available
Build failures during:       - = unknown or N/A
c = Configure, m = make, M = make (after miniperl), t = make test-prep

   34101     Configuration (common) -DCCTYPE=MSVC90 -DINST_TOP=$(INST_DRV)\Smoke\doesntexist
----------- ---------------------------------------------------------
F O         
O O         -Dusemymalloc
O O         -Duselargefiles
O O         -Duselargefiles -Dusemymalloc
O O         -Duseithreads -Uuseimpsys
O O         -Duseithreads -Uuseimpsys -Dusemymalloc
O O         -Duseithreads -Uuseimpsys -Duselargefiles
O O         -Duseithreads -Uuseimpsys -Duselargefiles -Dusemymalloc
F O         -Duseithreads
O F         -Duseithreads -Duselargefiles
| +--------- -DDEBUGGING
+----------- no debugging


Locally applied patches:
    DEVEL
    SMOKE34101

Failures: (common-args) -DCCTYPE=MSVC90 -DINST_TOP=$(INST_DRV)\Smoke\doesntexist
[default] 
op/rand.t...................................................FAILED
    5

[default] -Duseithreads
[default] -DDEBUGGING -Duseithreads -Duselargefiles
../ext/IO/t/io_sock.t.......................................FAILED
../ext/threads/shared/t/stress.t............................FAILED

MANIFEST did not declare 'LIB/EXTUTILS/MINIPERL.PM'
MANIFEST did not declare 'PATCHLEVEL.BAK'
MANIFEST did not declare 'POLICY.SH'
MANIFEST did not declare 'T/PEEK_EVAL1468'
MANIFEST did not declare 'T/PEEK_EVAL1476'
MANIFEST did not declare 'T/PEEK_EVAL204'
MANIFEST did not declare 'T/PEEK_EVAL3548'
MANIFEST did not declare 'T/PEEK_EVAL3828'
MANIFEST did not declare 'T/PEEK_EVAL3996'
MANIFEST did not declare 'T/PEEK_EVAL4024'
MANIFEST did not declare 'T/PEEK_EVAL4156'
MANIFEST did not declare 'T/PEEK_EVAL4500'
MANIFEST did not declare 'T/PEEK_EVAL4648'
MANIFEST did not declare 'T/PEEK_EVAL4732'
MANIFEST did not declare 'T/PEEK_EVAL5096'
MANIFEST did not declare 'T/PEEK_EVAL5276'
MANIFEST did not declare 'T/PEEK_EVAL5396'
MANIFEST did not declare 'T/PEEK_EVAL5500'
MANIFEST did not declare 'T/PEEK_EVAL5528'
MANIFEST did not declare 'T/PEEK_EVAL5876'
MANIFEST did not declare 'WIN32/SMOKE.MK'

-- 
Report by Test::Smoke v1.29_60 build 1155 running on perl 5.10.0
(Reporter v0.032 / Smoker v0.038)




nntp.perl.org: Perl Programming lists via nntp and http.
Comments to Ask Bjørn Hansen at ask@perl.org | Group listing | About