develooper Front page | perl.perl5.porters | Postings from July 2008

Smoke [5.11.0] 34116 FAIL(F) MSWin32 WinXP/.Net SP3 (x86/2 cpu)

From:
Steve Hay
Date:
July 10, 2008 01:12
Subject:
Smoke [5.11.0] 34116 FAIL(F) MSWin32 WinXP/.Net SP3 (x86/2 cpu)
Message ID:
UKMAIL02pDKicUbvBDx000025c7@ukmail02.planit.group
Automated smoke report for 5.11.0 patch 34116
maldoror.bath.planit.group: Intel(R) Core(TM)2 CPU 6700 @ 2.66GHz(~2660 MHz) (x86/2 cpu)
    on        MSWin32 - WinXP/.Net SP3
    using     cl version 13.10.3077
    smoketime 10 hours 24 minutes (average 31 minutes 15 seconds)

Summary: FAIL(F)

O = OK  F = Failure(s), extended report at the bottom
X = Failure(s) under TEST but not under harness
? = still running or test results not (yet) available
Build failures during:       - = unknown or N/A
c = Configure, m = make, M = make (after miniperl), t = make test-prep

   34116     Configuration (common) -DCCTYPE=MSVC70FREE -DINST_TOP=$(INST_DRV)\Smoke\doesntexist
----------- ---------------------------------------------------------
O O         
O O         -Dusemymalloc
O O         -Duselargefiles
O O         -Duselargefiles -Dusemymalloc
O O         -Duseithreads -Uuseimpsys
O O         -Duseithreads -Uuseimpsys -Dusemymalloc
O O         -Duseithreads -Uuseimpsys -Duselargefiles
O O         -Duseithreads -Uuseimpsys -Duselargefiles -Dusemymalloc
O F         -Duseithreads
F O         -Duseithreads -Duselargefiles
| +--------- -DDEBUGGING
+----------- no debugging


Locally applied patches:
    DEVEL
    SMOKE34116

Failures: (common-args) -DCCTYPE=MSVC70FREE -DINST_TOP=$(INST_DRV)\Smoke\doesntexist
[default] -DDEBUGGING -Duseithreads
../ext/IO/t/io_multihomed.t.................................FAILED
../ext/threads/shared/t/stress.t............................FAILED

[default] -Duseithreads -Duselargefiles
../ext/IO/t/io_multihomed.t.................................FAILED
    Bad plan.  You planned 8 tests but ran 4.
../ext/IO/t/io_sock.t.......................................FAILED
../ext/threads/shared/t/stress.t............................FAILED
../lib/Tie/File/t/28_mtwrite.t..............................FAILED
    Bad plan.  You planned 2252 tests but ran 1408.

Compiler messages(MSWin32):
shared.xs(881) : warning C4146: unary minus operator applied to unsigned type, result still unsigned
shared.xs(935) : warning C4146: unary minus operator applied to unsigned type, result still unsigned
shared.xs(970) : warning C4146: unary minus operator applied to unsigned type, result still unsigned
shared.xs(1292) : warning C4146: unary minus operator applied to unsigned type, result still unsigned

-- 
Report by Test::Smoke v1.29_60 build 1155 running on perl 5.9.5
(Reporter v0.032 / Smoker v0.038)




nntp.perl.org: Perl Programming lists via nntp and http.
Comments to Ask Bjørn Hansen at ask@perl.org | Group listing | About