develooper Front page | perl.perl5.porters | Postings from June 2008

Smoke [5.11.0] 34071 FAIL(Ft) MSWin32 WinXP/.Net SP3 (x86/2 cpu)

From:
Steve Hay
Date:
June 17, 2008 18:50
Subject:
Smoke [5.11.0] 34071 FAIL(Ft) MSWin32 WinXP/.Net SP3 (x86/2 cpu)
Message ID:
UKMAIL02gPasSmz6UuE00001646@ukmail02.planit.group
Automated smoke report for 5.11.0 patch 34071
maldoror.bath.planit.group: Intel(R) Core(TM)2 CPU 6700 @ 2.66GHz(~2660 MHz) (x86/2 cpu)
    on        MSWin32 - WinXP/.Net SP3
    using     cl version 12.00.8804
    smoketime 4 hours 3 minutes (average 12 minutes 11 seconds)

Summary: FAIL(Ft)

O = OK  F = Failure(s), extended report at the bottom
X = Failure(s) under TEST but not under harness
? = still running or test results not (yet) available
Build failures during:       - = unknown or N/A
c = Configure, m = make, M = make (after miniperl), t = make test-prep

   34071     Configuration (common) -DINST_TOP=$(INST_DRV)\Smoke\doesntexist
----------- ---------------------------------------------------------
O O         
O O         -Dusemymalloc
O O         -Duseithreads -Uuseimpsys
O O         -Duseithreads -Uuseimpsys -Dusemymalloc
O O         -Duseithreads
F t         -Accflags='-DPERL_OLD_COPY_ON_WRITE'
F t         -Accflags='-DPERL_OLD_COPY_ON_WRITE' -Dusemymalloc
F t         -Accflags='-DPERL_OLD_COPY_ON_WRITE' -Duseithreads -Uuseimpsys
F t         -Accflags='-DPERL_OLD_COPY_ON_WRITE' -Duseithreads -Uuseimpsys -Dusemymalloc
F t         -Accflags='-DPERL_OLD_COPY_ON_WRITE' -Duseithreads
| +--------- -DDEBUGGING
+----------- no debugging


Locally applied patches:
    DEVEL
    SMOKE34071

Failures: (common-args) -DINST_TOP=$(INST_DRV)\Smoke\doesntexist
[default] -Accflags='-DPERL_OLD_COPY_ON_WRITE'
[default] -Accflags='-DPERL_OLD_COPY_ON_WRITE' -Dusemymalloc
[default] -Accflags='-DPERL_OLD_COPY_ON_WRITE' -Duseithreads -Uuseimpsys
[default] -Accflags='-DPERL_OLD_COPY_ON_WRITE' -Duseithreads -Uuseimpsys -Dusemymalloc
../ext/Compress/Raw/Zlib/t/07bufsize.t......................FAILED
    Bad plan.  You planned 288 tests but ran 41.

[default] -Accflags='-DPERL_OLD_COPY_ON_WRITE' -Duseithreads
../ext/Compress/Raw/Zlib/t/07bufsize.t......................FAILED
    Bad plan.  You planned 288 tests but ran 41.
../ext/threads/shared/t/stress.t............................FAILED

-- 
Report by Test::Smoke v1.29_60 build 1155 running on perl 5.9.5
(Reporter v0.032 / Smoker v0.038)




nntp.perl.org: Perl Programming lists via nntp and http.
Comments to Ask Bjørn Hansen at ask@perl.org | Group listing | About