develooper Front page | perl.perl5.porters | Postings from February 2008

Smoke [5.11.0] 33358 FAIL(F) MSWin32 WinXP/.Net SP2 (x86/2 cpu)

From:
Steve Hay
Date:
February 24, 2008 20:08
Subject:
Smoke [5.11.0] 33358 FAIL(F) MSWin32 WinXP/.Net SP2 (x86/2 cpu)
Message ID:
UKMAIL02HkidcDjoYAP0000001f@ukmail02.planit.group
Automated smoke report for 5.11.0 patch 33358
maldoror.bath.planit.group: Intel(R) Core(TM)2 CPU 6700 @ 2.66GHz(~2660 MHz) (x86/2 cpu)
    on        MSWin32 - WinXP/.Net SP2
    using     gcc version 3.4.2
    smoketime 5 hours 17 minutes (average 15 minutes 51 seconds)

Summary: FAIL(F)

O = OK  F = Failure(s), extended report at the bottom
X = Failure(s) under TEST but not under harness
? = still running or test results not (yet) available
Build failures during:       - = unknown or N/A
c = Configure, m = make, M = make (after miniperl), t = make test-prep

   33358     Configuration (common) -DINST_TOP=$(INST_DRV)\Smoke\doesntexist
----------- ---------------------------------------------------------
F F         
F F         -Dusemymalloc
F F         -Duselargefiles
F F         -Duselargefiles -Dusemymalloc
F F         -Duseithreads -Uuseimpsys
F F         -Duseithreads -Uuseimpsys -Dusemymalloc
F F         -Duseithreads -Uuseimpsys -Duselargefiles
F F         -Duseithreads -Uuseimpsys -Duselargefiles -Dusemymalloc
F F         -Duseithreads
F F         -Duseithreads -Duselargefiles
| +--------- -DDEBUGGING
+----------- no debugging


Locally applied patches:
    DEVEL
    SMOKE33358

Failures: (common-args) -DINST_TOP=$(INST_DRV)\Smoke\doesntexist
[default] 
[default] -Dusemymalloc
[default] -Duselargefiles
[default] -Duselargefiles -Dusemymalloc
[default] -Duseithreads -Uuseimpsys
[default] -Duseithreads -Uuseimpsys -Duselargefiles
[default] -Duseithreads
[default] -Duseithreads -Duselargefiles
../lib/CPANPLUS/Dist/Build/t/02_CPANPLUS-Dist-Build.t.......FAILED
    26-27
../lib/ExtUtils/CBuilder/t/01-basic.t.......................FAILED
    3
    Bad plan.  You planned 11 tests but ran 5.
../lib/Module/Build/t/ppm.t.................................FAILED
    Bad plan.  You planned 12 tests but ran 1.
../lib/Module/Build/t/xs.t..................................FAILED
    2-6
    Bad plan.  You planned 22 tests but ran 15.

[default] -DDEBUGGING
[default] -DDEBUGGING -Dusemymalloc
[default] -DDEBUGGING -Duselargefiles
[default] -DDEBUGGING -Duselargefiles -Dusemymalloc
[default] -DDEBUGGING -Duseithreads -Uuseimpsys -Duselargefiles -Dusemymalloc
../lib/CPANPLUS/Dist/Build/t/02_CPANPLUS-Dist-Build.t.......FAILED
    26-31
../lib/ExtUtils/CBuilder/t/01-basic.t.......................FAILED
    3
    Bad plan.  You planned 11 tests but ran 5.
../lib/Module/Build/t/ppm.t.................................FAILED
    Bad plan.  You planned 12 tests but ran 1.
../lib/Module/Build/t/xs.t..................................FAILED
    2-6, 10
    Bad plan.  You planned 22 tests but ran 15.

[default] -DDEBUGGING -Duseithreads -Uuseimpsys
[default] -DDEBUGGING -Duseithreads -Uuseimpsys -Dusemymalloc
[default] -DDEBUGGING -Duseithreads -Uuseimpsys -Duselargefiles
[default] -DDEBUGGING -Duseithreads
[default] -DDEBUGGING -Duseithreads -Duselargefiles
../ext/threads/shared/t/stress.t............................FAILED
../lib/CPANPLUS/Dist/Build/t/02_CPANPLUS-Dist-Build.t.......FAILED
    26-31
../lib/ExtUtils/CBuilder/t/01-basic.t.......................FAILED
    3
    Bad plan.  You planned 11 tests but ran 5.
../lib/Module/Build/t/ppm.t.................................FAILED
    Bad plan.  You planned 12 tests but ran 1.
../lib/Module/Build/t/xs.t..................................FAILED
    2-6, 10
    Bad plan.  You planned 22 tests but ran 15.

[default] -Duseithreads -Uuseimpsys -Dusemymalloc
[default] -Duseithreads -Uuseimpsys -Duselargefiles -Dusemymalloc
../ext/threads/shared/t/stress.t............................FAILED
../lib/CPANPLUS/Dist/Build/t/02_CPANPLUS-Dist-Build.t.......FAILED
    26-27
../lib/ExtUtils/CBuilder/t/01-basic.t.......................FAILED
    3
    Bad plan.  You planned 11 tests but ran 5.
../lib/Module/Build/t/ppm.t.................................FAILED
    Bad plan.  You planned 12 tests but ran 1.
../lib/Module/Build/t/xs.t..................................FAILED
    2-6
    Bad plan.  You planned 22 tests but ran 15.

Compiler messages(gcc):
perlhost.h: In function `CPerlHost* IPerlMem2Host(IPerlMem*)':
perlhost.h:247: warning: invalid access to non-static data member `CPerlHost::m_hostperlMem' of NULL object
perlhost.h:247: warning: (perhaps the `offsetof' macro was used incorrectly)
perlhost.h: In function `CPerlHost* IPerlMemShared2Host(IPerlMem*)':
perlhost.h:252: warning: invalid access to non-static data member `CPerlHost::m_hostperlMemShared' of NULL object
perlhost.h:252: warning: (perhaps the `offsetof' macro was used incorrectly)
perlhost.h: In function `CPerlHost* IPerlMemParse2Host(IPerlMem*)':
perlhost.h:257: warning: invalid access to non-static data member `CPerlHost::m_hostperlMemParse' of NULL object
perlhost.h:257: warning: (perhaps the `offsetof' macro was used incorrectly)
perlhost.h: In function `CPerlHost* IPerlEnv2Host(IPerlEnv*)':
perlhost.h:262: warning: invalid access to non-static data member `CPerlHost::m_hostperlEnv' of NULL object
perlhost.h:262: warning: (perhaps the `offsetof' macro was used incorrectly)
perlhost.h: In function `CPerlHost* IPerlStdIO2Host(IPerlStdIO*)':
perlhost.h:267: warning: invalid access to non-static data member `CPerlHost::m_hostperlStdIO' of NULL object
perlhost.h:267: warning: (perhaps the `offsetof' macro was used incorrectly)
perlhost.h: In function `CPerlHost* IPerlLIO2Host(IPerlLIO*)':
perlhost.h:272: warning: invalid access to non-static data member `CPerlHost::m_hostperlLIO' of NULL object
perlhost.h:272: warning: (perhaps the `offsetof' macro was used incorrectly)
perlhost.h: In function `CPerlHost* IPerlDir2Host(IPerlDir*)':
perlhost.h:277: warning: invalid access to non-static data member `CPerlHost::m_hostperlDir' of NULL object
perlhost.h:277: warning: (perhaps the `offsetof' macro was used incorrectly)
perlhost.h: In function `CPerlHost* IPerlSock2Host(IPerlSock*)':
perlhost.h:282: warning: invalid access to non-static data member `CPerlHost::m_hostperlSock' of NULL object
perlhost.h:282: warning: (perhaps the `offsetof' macro was used incorrectly)
perlhost.h: In function `CPerlHost* IPerlProc2Host(IPerlProc*)':
perlhost.h:287: warning: invalid access to non-static data member `CPerlHost::m_hostperlProc' of NULL object
perlhost.h:287: warning: (perhaps the `offsetof' macro was used incorrectly)

-- 
Report by Test::Smoke v1.29_60 build 1155 running on perl 5.9.5
(Reporter v0.032 / Smoker v0.038)




nntp.perl.org: Perl Programming lists via nntp and http.
Comments to Ask Bjørn Hansen at ask@perl.org | Group listing | About