develooper Front page | perl.perl5.porters | Postings from February 2008

Smoke [5.11.0] 33334 FAIL(FM) MSWin32 WinXP/.Net SP2 (x86/2 cpu)

From:
Steve Hay
Date:
February 19, 2008 18:24
Subject:
Smoke [5.11.0] 33334 FAIL(FM) MSWin32 WinXP/.Net SP2 (x86/2 cpu)
Message ID:
UKMAIL02IhTrBoe2U8Q000000dc@ukmail02.planit.group
Automated smoke report for 5.11.0 patch 33334
maldoror.bath.planit.group: Intel(R) Core(TM)2 CPU 6700 @ 2.66GHz(~2660 MHz) (x86/2 cpu)
    on        MSWin32 - WinXP/.Net SP2
    using     cl version 12.00.8804
    smoketime 3 hours 42 minutes (average 11 minutes 8 seconds)

Summary: FAIL(FM)

O = OK  F = Failure(s), extended report at the bottom
X = Failure(s) under TEST but not under harness
? = still running or test results not (yet) available
Build failures during:       - = unknown or N/A
c = Configure, m = make, M = make (after miniperl), t = make test-prep

   33334     Configuration (common) -DINST_TOP=$(INST_DRV)\Smoke\doesntexist
----------- ---------------------------------------------------------
F F         
F F         -Dusemymalloc
F F         -Duseithreads -Uuseimpsys
F F         -Duseithreads -Uuseimpsys -Dusemymalloc
F F         -Duseithreads
F M         -Accflags='-DPERL_OLD_COPY_ON_WRITE'
F M         -Accflags='-DPERL_OLD_COPY_ON_WRITE' -Dusemymalloc
F M         -Accflags='-DPERL_OLD_COPY_ON_WRITE' -Duseithreads -Uuseimpsys
F M         -Accflags='-DPERL_OLD_COPY_ON_WRITE' -Duseithreads -Uuseimpsys -Dusemymalloc
F M         -Accflags='-DPERL_OLD_COPY_ON_WRITE' -Duseithreads
| +--------- -DDEBUGGING
+----------- no debugging


Locally applied patches:
    DEVEL
    SMOKE33334

Failures: (common-args) -DINST_TOP=$(INST_DRV)\Smoke\doesntexist
[default] 
[default] -DDEBUGGING
[default] -Dusemymalloc
[default] -DDEBUGGING -Dusemymalloc
../lib/ExtUtils/CBuilder/t/01-basic.t.......................FAILED
    9-11
../lib/Module/Build/t/compat.t..............................FAILED
    115

[default] -Duseithreads -Uuseimpsys
[default] -DDEBUGGING -Duseithreads -Uuseimpsys
[default] -Duseithreads -Uuseimpsys -Dusemymalloc
[default] -DDEBUGGING -Duseithreads -Uuseimpsys -Dusemymalloc
[default] -Duseithreads
[default] -DDEBUGGING -Duseithreads
../ext/threads/shared/t/stress.t............................FAILED
../lib/ExtUtils/CBuilder/t/01-basic.t.......................FAILED
    9-11
../lib/Module/Build/t/compat.t..............................FAILED
    115

[default] -Accflags='-DPERL_OLD_COPY_ON_WRITE'
[default] -Accflags='-DPERL_OLD_COPY_ON_WRITE' -Dusemymalloc
[default] -Accflags='-DPERL_OLD_COPY_ON_WRITE' -Duseithreads -Uuseimpsys
../ext/Compress/Raw/Zlib/t/07bufsize.t......................FAILED
    Bad plan.  You planned 288 tests but ran 41.
../lib/ExtUtils/CBuilder/t/01-basic.t.......................FAILED
    9-11
../lib/Module/Build/t/compat.t..............................FAILED
    115

[default] -Accflags='-DPERL_OLD_COPY_ON_WRITE' -Duseithreads -Uuseimpsys -Dusemymalloc
[default] -Accflags='-DPERL_OLD_COPY_ON_WRITE' -Duseithreads
../ext/Compress/Raw/Zlib/t/07bufsize.t......................FAILED
    Bad plan.  You planned 288 tests but ran 41.
../ext/threads/shared/t/stress.t............................FAILED
../lib/ExtUtils/CBuilder/t/01-basic.t.......................FAILED
    9-11
../lib/Module/Build/t/compat.t..............................FAILED
    115

Compiler messages(MSWin32):
..\sv.c(505) : warning C4028: formal parameter 1 different from declaration
..\sv.c(505) : warning C4024: 'S_visit' : different types for formal and actual parameter 1
..\sv.c(540) : warning C4028: formal parameter 1 different from declaration
..\sv.c(540) : warning C4024: 'S_visit' : different types for formal and actual parameter 1
..\sv.c(505) : warning C4028: formal parameter 2 different from declaration
..\sv.c(505) : warning C4024: 'S_visit' : different types for formal and actual parameter 2
..\sv.c(540) : warning C4028: formal parameter 2 different from declaration
..\sv.c(540) : warning C4024: 'S_visit' : different types for formal and actual parameter 2
..\sv.c(3963) : error C2065: 'dsv' : undeclared identifier
..\sv.c(3963) : error C2065: 'ssv' : undeclared identifier

-- 
Report by Test::Smoke v1.29_60 build 1155 running on perl 5.9.5
(Reporter v0.032 / Smoker v0.038)




nntp.perl.org: Perl Programming lists via nntp and http.
Comments to Ask Bjørn Hansen at ask@perl.org | Group listing | About